Page Menu
Home
Phabricator
Search
Configure Global Search
Log In
Files
F56922607
/usr/bin/chromium no rosetta
No One
Actions
View File
Edit File
Delete File
View Transforms
Subscribe
Authored By
•
zeljkofilipin
Aug 2 2024, 1:53 PM
2024-08-02 13:53:48 (UTC+0)
Size
3 KB
Referenced Files
None
Subscribers
None
/usr/bin/chromium no rosetta
View Options
nobody@docker-desktop:/core$ npm run selenium-test
> selenium-test
> wdio ./tests/selenium/wdio.conf.js
Execution of 6 workers started at 2024-08-02T13:50:30.443Z
[0-0] RUNNING in chrome - /tests/selenium/docs/Create_a_simple_test/specs/specialpages.js
[0-3] RUNNING in chrome - /tests/selenium/specs/user.js
[0-2] RUNNING in chrome - /tests/selenium/specs/recentchanges.js
[0-1] RUNNING in chrome - /tests/selenium/specs/page.js
[0-0] 2024-08-02T13:51:04.441Z ERROR @wdio/runner: Error: connect ECONNREFUSED 127.0.0.1:56169
[0-0] at TCPConnectWrap.afterConnect [as oncomplete] (node:net:1555:16)
[0-0] RETRYING in chrome - /tests/selenium/docs/Create_a_simple_test/specs/specialpages.js
[0-1] 2024-08-02T13:51:05.943Z ERROR @wdio/runner: Error: connect ECONNREFUSED 127.0.0.1:55519
[0-1] at TCPConnectWrap.afterConnect [as oncomplete] (node:net:1555:16)
[0-2] 2024-08-02T13:51:05.944Z ERROR @wdio/runner: Error: connect ECONNREFUSED 127.0.0.1:58035
[0-2] at TCPConnectWrap.afterConnect [as oncomplete] (node:net:1555:16)
[0-3] 2024-08-02T13:51:05.945Z ERROR @wdio/runner: Error: connect ECONNREFUSED 127.0.0.1:56637
[0-3] at TCPConnectWrap.afterConnect [as oncomplete] (node:net:1555:16)
[0-1] RETRYING in chrome - /tests/selenium/specs/page.js
[0-2] RETRYING in chrome - /tests/selenium/specs/recentchanges.js
[0-3] RETRYING in chrome - /tests/selenium/specs/user.js
[0-0] RUNNING in chrome - /tests/selenium/docs/Create_a_simple_test/specs/specialpages.js
[0-2] RUNNING in chrome - /tests/selenium/specs/recentchanges.js
[0-3] RUNNING in chrome - /tests/selenium/specs/user.js
[0-1] RUNNING in chrome - /tests/selenium/specs/page.js
[0-0] 2024-08-02T13:51:37.189Z ERROR @wdio/runner: Error: connect ECONNREFUSED 127.0.0.1:56369
[0-0] at TCPConnectWrap.afterConnect [as oncomplete] (node:net:1555:16)
[0-0] FAILED in chrome - /tests/selenium/docs/Create_a_simple_test/specs/specialpages.js (1 retries)
[0-3] 2024-08-02T13:51:41.254Z ERROR @wdio/runner: Error: connect ECONNREFUSED 127.0.0.1:55785
[0-3] at TCPConnectWrap.afterConnect [as oncomplete] (node:net:1555:16)
[0-1] 2024-08-02T13:51:41.255Z ERROR @wdio/runner: Error: connect ECONNREFUSED 127.0.0.1:57241
[0-1] at TCPConnectWrap.afterConnect [as oncomplete] (node:net:1555:16)
[0-2] 2024-08-02T13:51:41.256Z ERROR @wdio/runner: Error: connect ECONNREFUSED 127.0.0.1:59753
[0-2] at TCPConnectWrap.afterConnect [as oncomplete] (node:net:1555:16)
[0-1] FAILED in chrome - /tests/selenium/specs/page.js (1 retries)
[0-2] FAILED in chrome - /tests/selenium/specs/recentchanges.js (1 retries)
[0-3] FAILED in chrome - /tests/selenium/specs/user.js (1 retries)
[0-4] RUNNING in chrome - /tests/selenium/specs/watchlist.js
[0-5] RUNNING in chrome - /tests/selenium/wdio-mediawiki/specs/BlankPage.js
[0-4] 2024-08-02T13:52:08.704Z ERROR @wdio/runner: Error: connect ECONNREFUSED 127.0.0.1:58475
[0-4] at TCPConnectWrap.afterConnect [as oncomplete] (node:net:1555:16)
[0-4] RETRYING in chrome - /tests/selenium/specs/watchlist.js
[0-5] 2024-08-02T13:52:11.958Z ERROR @wdio/runner: Error: connect ECONNREFUSED 127.0.0.1:59515
[0-5] at TCPConnectWrap.afterConnect [as oncomplete] (node:net:1555:16)
[0-5] RETRYING in chrome - /tests/selenium/wdio-mediawiki/specs/BlankPage.js
[0-4] RUNNING in chrome - /tests/selenium/specs/watchlist.js
[0-5] RUNNING in chrome - /tests/selenium/wdio-mediawiki/specs/BlankPage.js
[0-4] 2024-08-02T13:52:40.626Z ERROR @wdio/runner: Error: connect ECONNREFUSED 127.0.0.1:56443
[0-4] at TCPConnectWrap.afterConnect [as oncomplete] (node:net:1555:16)
[0-4] FAILED in chrome - /tests/selenium/specs/watchlist.js (1 retries)
[0-5] 2024-08-02T13:52:42.969Z ERROR @wdio/runner: Error: connect ECONNREFUSED 127.0.0.1:58297
[0-5] at TCPConnectWrap.afterConnect [as oncomplete] (node:net:1555:16)
[0-5] FAILED in chrome - /tests/selenium/wdio-mediawiki/specs/BlankPage.js (1 retries)
Spec Files: 0 passed, 6 retries, 6 failed, 6 total (100% completed) in 00:02:12
File Metadata
Details
Attached
Mime Type
text/plain; charset=utf-8
Storage Engine
blob
Storage Format
Raw Data
Storage Handle
18618298
Default Alt Text
/usr/bin/chromium no rosetta (3 KB)
Attached To
Mode
P67206 /usr/bin/chromium - rosetta
Attached
Detach File
Event Timeline
Log In to Comment