Page MenuHomePhabricator
Paste P14484

master without chromedriver
ArchivedPublic

Authored by zeljkofilipin on Feb 25 2021, 4:39 PM.
~/Documents/gerrit/mediawiki/core$ git branch
* master
~/Documents/gerrit/mediawiki/core$ fresh-node -env -net
# fresh: 21.01.1 (2021-01-27)
# image: docker-registry.wikimedia.org/releng/node10-test-browser:0.6.2
# software: Debian GNU/Linux 9 (stretch)
# Node.js v10.15.2 (npm 6.14.5)
# Chromium 71.0.3578.80
# Mozilla Firefox 68.11.0esr
# JSDuck 5.3.4 (Ruby 2.3.3)
# mount: /core ➟ /Users/z/Documents/gerrit/mediawiki/core (read-write)
# /core/.git ➟ /Users/z/Documents/gerrit/mediawiki/core/.git (read-only)
# env: MW_*, MEDIAWIKI_*
# net: expose host
🌱 Fresh!
nobody@docker-desktop:/core$ npm run selenium-test
> @ selenium-test /core
> wdio ./tests/selenium/wdio.conf.js
Execution of 6 spec files started at 2021-02-25T17:04:03.365Z
(node:20) ExperimentalWarning: The dns.promises API is experimental
(node:20) ExperimentalWarning: The fs.promises API is experimental
[0-0] (node:29) ExperimentalWarning: The dns.promises API is experimental
[0-0] (node:29) ExperimentalWarning: The fs.promises API is experimental
[0-0] RUNNING in chrome - /tests/selenium/wdio-mediawiki/specs/BlankPage.js
[0-0] (node:29) DeprecationWarning: Got: "options.rejectUnauthorized" is now deprecated, please use "options.https.rejectUnauthorized"
[0-0] 2021-02-25T17:04:08.033Z ERROR webdriver: RequestError: connect ECONNREFUSED 127.0.0.1:4444
at ClientRequest.request.once (/core/node_modules/got/dist/source/core/index.js:953:111)
at Object.onceWrapper (events.js:277:13)
at ClientRequest.emit (events.js:194:15)
at ClientRequest.EventEmitter.emit (domain.js:441:20)
at ClientRequest.origin.emit.args (/core/node_modules/@szmarczak/http-timer/dist/source/index.js:39:20)
at Socket.socketErrorListener (_http_client.js:392:9)
at Socket.emit (events.js:189:13)
at Socket.EventEmitter.emit (domain.js:441:20)
at emitErrorNT (internal/streams/destroy.js:82:8)
at emitErrorAndCloseNT (internal/streams/destroy.js:50:3)
at TCPConnectWrap.afterConnect [as oncomplete] (net.js:1104:14)
[0-0] 2021-02-25T17:04:08.036Z ERROR @wdio/runner: Error: Failed to create session.
Unable to connect to "http://127.0.0.1:4444/wd/hub", make sure browser driver is running on that address.
If you use services like chromedriver see initialiseServices logs above or in wdio.log file as the service might had problems to start the driver.
at startWebDriverSession (/core/node_modules/webdriver/build/utils.js:45:11)
at process._tickCallback (internal/process/next_tick.js:68:7)
[0-0] Error: Failed to create session.
Unable to connect to "http://127.0.0.1:4444/wd/hub", make sure browser driver is running on that address.
If you use services like chromedriver see initialiseServices logs above or in wdio.log file as the service might had problems to start the driver.
[0-0] 2021-02-25T17:04:13.056Z ERROR @wdio/runner: Error: Some reporters are still unsynced: Video
at Timeout.setInterval (/core/node_modules/@wdio/runner/build/reporter.js:86:25)
at ontimeout (timers.js:436:11)
at tryOnTimeout (timers.js:300:5)
at listOnTimeout (timers.js:263:5)
at Timer.processTimers (timers.js:223:10)
[0-0] FAILED in chrome - /tests/selenium/wdio-mediawiki/specs/BlankPage.js
[0-1] (node:42) ExperimentalWarning: The dns.promises API is experimental
[0-1] (node:42) ExperimentalWarning: The fs.promises API is experimental
[0-1] RUNNING in chrome - /tests/selenium/specs/page.js
[0-1] (node:42) DeprecationWarning: Got: "options.rejectUnauthorized" is now deprecated, please use "options.https.rejectUnauthorized"
[0-1] 2021-02-25T17:04:18.530Z ERROR webdriver: RequestError: connect ECONNREFUSED 127.0.0.1:4444
at ClientRequest.request.once (/core/node_modules/got/dist/source/core/index.js:953:111)
at Object.onceWrapper (events.js:277:13)
at ClientRequest.emit (events.js:194:15)
at ClientRequest.EventEmitter.emit (domain.js:441:20)
at ClientRequest.origin.emit.args (/core/node_modules/@szmarczak/http-timer/dist/source/index.js:39:20)
at Socket.socketErrorListener (_http_client.js:392:9)
at Socket.emit (events.js:189:13)
at Socket.EventEmitter.emit (domain.js:441:20)
at emitErrorNT (internal/streams/destroy.js:82:8)
at emitErrorAndCloseNT (internal/streams/destroy.js:50:3)
at process._tickCallback (internal/process/next_tick.js:63:19)
at TCPConnectWrap.afterConnect [as oncomplete] (net.js:1104:14)
[0-1] 2021-02-25T17:04:18.533Z ERROR @wdio/runner: Error: Failed to create session.
Unable to connect to "http://127.0.0.1:4444/wd/hub", make sure browser driver is running on that address.
If you use services like chromedriver see initialiseServices logs above or in wdio.log file as the service might had problems to start the driver.
at startWebDriverSession (/core/node_modules/webdriver/build/utils.js:45:11)
at process._tickCallback (internal/process/next_tick.js:68:7)
[0-1] Error: Failed to create session.
Unable to connect to "http://127.0.0.1:4444/wd/hub", make sure browser driver is running on that address.
If you use services like chromedriver see initialiseServices logs above or in wdio.log file as the service might had problems to start the driver.
[0-1] 2021-02-25T17:04:23.628Z ERROR @wdio/runner: Error: Some reporters are still unsynced: Video
at Timeout.setInterval (/core/node_modules/@wdio/runner/build/reporter.js:86:25)
at ontimeout (timers.js:436:11)
at tryOnTimeout (timers.js:300:5)
at listOnTimeout (timers.js:263:5)
at Timer.processTimers (timers.js:223:10)
[0-1] FAILED in chrome - /tests/selenium/specs/page.js
[0-2] (node:55) ExperimentalWarning: The dns.promises API is experimental
[0-2] (node:55) ExperimentalWarning: The fs.promises API is experimental
[0-2] RUNNING in chrome - /tests/selenium/specs/rollback.js
[0-2] (node:55) DeprecationWarning: Got: "options.rejectUnauthorized" is now deprecated, please use "options.https.rejectUnauthorized"
[0-2] 2021-02-25T17:04:29.387Z ERROR webdriver: RequestError: connect ECONNREFUSED 127.0.0.1:4444
at ClientRequest.request.once (/core/node_modules/got/dist/source/core/index.js:953:111)
at Object.onceWrapper (events.js:277:13)
at ClientRequest.emit (events.js:194:15)
at ClientRequest.EventEmitter.emit (domain.js:441:20)
at ClientRequest.origin.emit.args (/core/node_modules/@szmarczak/http-timer/dist/source/index.js:39:20)
at Socket.socketErrorListener (_http_client.js:392:9)
at Socket.emit (events.js:189:13)
at Socket.EventEmitter.emit (domain.js:441:20)
at emitErrorNT (internal/streams/destroy.js:82:8)
at emitErrorAndCloseNT (internal/streams/destroy.js:50:3)
at process._tickCallback (internal/process/next_tick.js:63:19)
at TCPConnectWrap.afterConnect [as oncomplete] (net.js:1104:14)
2021-02-25T17:04:29.389Z ERROR @wdio/runner: Error: Failed to create session.
Unable to connect to "http://127.0.0.1:4444/wd/hub", make sure browser driver is running on that address.
If you use services like chromedriver see initialiseServices logs above or in wdio.log file as the service might had problems to start the driver.
at startWebDriverSession (/core/node_modules/webdriver/build/utils.js:45:11)
at process._tickCallback (internal/process/next_tick.js:68:7)
[0-2] Error: Failed to create session.
Unable to connect to "http://127.0.0.1:4444/wd/hub", make sure browser driver is running on that address.
If you use services like chromedriver see initialiseServices logs above or in wdio.log file as the service might had problems to start the driver.
[0-2] 2021-02-25T17:04:34.411Z ERROR @wdio/runner: Error: Some reporters are still unsynced: Video
at Timeout.setInterval (/core/node_modules/@wdio/runner/build/reporter.js:86:25)
at ontimeout (timers.js:436:11)
at tryOnTimeout (timers.js:300:5)
at listOnTimeout (timers.js:263:5)
at Timer.processTimers (timers.js:223:10)
[0-2] FAILED in chrome - /tests/selenium/specs/rollback.js
[0-3] (node:68) ExperimentalWarning: The dns.promises API is experimental
[0-3] (node:68) ExperimentalWarning: The fs.promises API is experimental
[0-3] RUNNING in chrome - /tests/selenium/specs/specialrecentchanges.js
[0-3] (node:68) DeprecationWarning: Got: "options.rejectUnauthorized" is now deprecated, please use "options.https.rejectUnauthorized"
[0-3] 2021-02-25T17:04:40.982Z ERROR webdriver: RequestError: connect ECONNREFUSED 127.0.0.1:4444
at ClientRequest.request.once (/core/node_modules/got/dist/source/core/index.js:953:111)
at Object.onceWrapper (events.js:277:13)
at ClientRequest.emit (events.js:194:15)
at ClientRequest.EventEmitter.emit (domain.js:441:20)
at ClientRequest.origin.emit.args (/core/node_modules/@szmarczak/http-timer/dist/source/index.js:39:20)
at Socket.socketErrorListener (_http_client.js:392:9)
at Socket.emit (events.js:189:13)
at Socket.EventEmitter.emit (domain.js:441:20)
at emitErrorNT (internal/streams/destroy.js:82:8)
at emitErrorAndCloseNT (internal/streams/destroy.js:50:3)
at process._tickCallback (internal/process/next_tick.js:63:19)
at TCPConnectWrap.afterConnect [as oncomplete] (net.js:1104:14)
[0-3] 2021-02-25T17:04:40.983Z ERROR @wdio/runner: Error: Failed to create session.
Unable to connect to "http://127.0.0.1:4444/wd/hub", make sure browser driver is running on that address.
If you use services like chromedriver see initialiseServices logs above or in wdio.log file as the service might had problems to start the driver.
at startWebDriverSession (/core/node_modules/webdriver/build/utils.js:45:11)
at process._tickCallback (internal/process/next_tick.js:68:7)
[0-3] Error: Failed to create session.
Unable to connect to "http://127.0.0.1:4444/wd/hub", make sure browser driver is running on that address.
If you use services like chromedriver see initialiseServices logs above or in wdio.log file as the service might had problems to start the driver.
[0-3] 2021-02-25T17:04:46.004Z ERROR @wdio/runner: Error: Some reporters are still unsynced: Video
at Timeout.setInterval (/core/node_modules/@wdio/runner/build/reporter.js:86:25)
at ontimeout (timers.js:436:11)
at tryOnTimeout (timers.js:300:5)
at listOnTimeout (timers.js:263:5)
at Timer.processTimers (timers.js:223:10)
[0-3] FAILED in chrome - /tests/selenium/specs/specialrecentchanges.js
[0-4] (node:81) ExperimentalWarning: The dns.promises API is experimental
[0-4] (node:81) ExperimentalWarning: The fs.promises API is experimental
[0-4] RUNNING in chrome - /tests/selenium/specs/specialwatchlist.js
[0-4] (node:81) DeprecationWarning: Got: "options.rejectUnauthorized" is now deprecated, please use "options.https.rejectUnauthorized"
[0-4] 2021-02-25T17:04:51.377Z ERROR webdriver: RequestError: connect ECONNREFUSED 127.0.0.1:4444
at ClientRequest.request.once (/core/node_modules/got/dist/source/core/index.js:953:111)
at Object.onceWrapper (events.js:277:13)
at ClientRequest.emit (events.js:194:15)
at ClientRequest.EventEmitter.emit (domain.js:441:20)
at ClientRequest.origin.emit.args (/core/node_modules/@szmarczak/http-timer/dist/source/index.js:39:20)
at Socket.socketErrorListener (_http_client.js:392:9)
at Socket.emit (events.js:189:13)
at Socket.EventEmitter.emit (domain.js:441:20)
at emitErrorNT (internal/streams/destroy.js:82:8)
at emitErrorAndCloseNT (internal/streams/destroy.js:50:3)
at process._tickCallback (internal/process/next_tick.js:63:19)
at TCPConnectWrap.afterConnect [as oncomplete] (net.js:1104:14)
[0-4] 2021-02-25T17:04:51.382Z ERROR @wdio/runner: Error: Failed to create session.
Unable to connect to "http://127.0.0.1:4444/wd/hub", make sure browser driver is running on that address.
If you use services like chromedriver see initialiseServices logs above or in wdio.log file as the service might had problems to start the driver.
at startWebDriverSession (/core/node_modules/webdriver/build/utils.js:45:11)
at process._tickCallback (internal/process/next_tick.js:68:7)
[0-4] Error: Failed to create session.
Unable to connect to "http://127.0.0.1:4444/wd/hub", make sure browser driver is running on that address.
If you use services like chromedriver see initialiseServices logs above or in wdio.log file as the service might had problems to start the driver.
[0-4] 2021-02-25T17:04:56.444Z ERROR @wdio/runner: Error: Some reporters are still unsynced: Video
at Timeout.setInterval (/core/node_modules/@wdio/runner/build/reporter.js:86:25)
at ontimeout (timers.js:436:11)
at tryOnTimeout (timers.js:300:5)
at listOnTimeout (timers.js:263:5)
at Timer.processTimers (timers.js:223:10)
[0-4] FAILED in chrome - /tests/selenium/specs/specialwatchlist.js
[0-5] (node:94) ExperimentalWarning: The dns.promises API is experimental
[0-5] (node:94) ExperimentalWarning: The fs.promises API is experimental
[0-5] RUNNING in chrome - /tests/selenium/specs/user.js
[0-5] (node:94) DeprecationWarning: Got: "options.rejectUnauthorized" is now deprecated, please use "options.https.rejectUnauthorized"
[0-5] 2021-02-25T17:05:01.900Z ERROR webdriver: RequestError: connect ECONNREFUSED 127.0.0.1:4444
at ClientRequest.request.once (/core/node_modules/got/dist/source/core/index.js:953:111)
at Object.onceWrapper (events.js:277:13)
at ClientRequest.emit (events.js:194:15)
at ClientRequest.EventEmitter.emit (domain.js:441:20)
at ClientRequest.origin.emit.args (/core/node_modules/@szmarczak/http-timer/dist/source/index.js:39:20)
at Socket.socketErrorListener (_http_client.js:392:9)
at Socket.emit (events.js:189:13)
at Socket.EventEmitter.emit (domain.js:441:20)
at emitErrorNT (internal/streams/destroy.js:82:8)
at emitErrorAndCloseNT (internal/streams/destroy.js:50:3)
at process._tickCallback (internal/process/next_tick.js:63:19)
at TCPConnectWrap.afterConnect [as oncomplete] (net.js:1104:14)
2021-02-25T17:05:01.902Z ERROR @wdio/runner: Error: Failed to create session.
Unable to connect to "http://127.0.0.1:4444/wd/hub", make sure browser driver is running on that address.
If you use services like chromedriver see initialiseServices logs above or in wdio.log file as the service might had problems to start the driver.
at startWebDriverSession (/core/node_modules/webdriver/build/utils.js:45:11)
at process._tickCallback (internal/process/next_tick.js:68:7)
[0-5] Error: Failed to create session.
Unable to connect to "http://127.0.0.1:4444/wd/hub", make sure browser driver is running on that address.
If you use services like chromedriver see initialiseServices logs above or in wdio.log file as the service might had problems to start the driver.
[0-5] 2021-02-25T17:05:06.983Z ERROR @wdio/runner: Error: Some reporters are still unsynced: Video
at Timeout.setInterval (/core/node_modules/@wdio/runner/build/reporter.js:86:25)
at ontimeout (timers.js:436:11)
at tryOnTimeout (timers.js:300:5)
at listOnTimeout (timers.js:263:5)
at Timer.processTimers (timers.js:223:10)
[0-5] FAILED in chrome - /tests/selenium/specs/user.js
Spec Files: 0 passed, 6 failed, 6 total (100% completed) in 00:01:03
npm ERR! code ELIFECYCLE
npm ERR! errno 1
npm ERR! @ selenium-test: `wdio ./tests/selenium/wdio.conf.js`
npm ERR! Exit status 1
npm ERR!
npm ERR! Failed at the @ selenium-test script.
npm ERR! This is probably not a problem with npm. There is likely additional logging output above.
npm ERR! A complete log of this run can be found in:
npm ERR! /cache/_logs/2021-02-25T17_05_07_277Z-debug.log