Page MenuHomePhabricator
Paste P17146

CodeMirror$ npm run selenium-test
ArchivedPublic

Authored by zeljkofilipin on Sep 2 2021, 9:57 AM.
Tags
None
Referenced Files
F34763473: CodeMirror$ npm run selenium-test
Nov 23 2021, 3:46 PM
F34715319: CodeMirror$ npm run selenium-test
Oct 29 2021, 2:20 PM
F34629146: CodeMirror$ npm run selenium-test
Sep 2 2021, 9:57 AM
Subscribers
None
I have no name!@imac:/CodeMirror$ npm run selenium-test
> @ selenium-test /CodeMirror
> wdio tests/selenium/wdio.conf.js
Execution of 3 spec files started at 2021-11-23T15:44:40.524Z
(node:399) ExperimentalWarning: The dns.promises API is experimental
(node:399) ExperimentalWarning: The fs.promises API is experimental
[0-0] (node:408) ExperimentalWarning: The dns.promises API is experimental
[0-0] (node:408) ExperimentalWarning: The fs.promises API is experimental
[0-0] RUNNING in chrome - /tests/selenium/specs/highlighting-disabled.js
[0-0] PASSED in chrome - /tests/selenium/specs/highlighting-disabled.js
[0-1] (node:512) ExperimentalWarning: The dns.promises API is experimental
[0-1] (node:512) ExperimentalWarning: The fs.promises API is experimental
[0-1] RUNNING in chrome - /tests/selenium/specs/highlighting-wikitext2010.js
[0-1] PASSED in chrome - /tests/selenium/specs/highlighting-wikitext2010.js
[0-2] (node:617) ExperimentalWarning: The dns.promises API is experimental
[0-2] (node:617) ExperimentalWarning: The fs.promises API is experimental
[0-2] RUNNING in chrome - /tests/selenium/specs/highlighting-wikitext2017.js
[0-2] AssertionError [ERR_ASSERTION] in "CodeMirror bracket match highlighting for the wikitext 2017 editor.matches according to cursor movement"
AssertionError [ERR_ASSERTION]: Input A expected to strictly equal input B:
+ expected - actual
- ''
+ '{}'
at Context.<anonymous> (/CodeMirror/tests/selenium/specs/highlighting-wikitext2017.js:34:10)
[0-2] FAILED in chrome - /tests/selenium/specs/highlighting-wikitext2017.js
"dot" Reporter:
....F
Spec Files: 2 passed, 1 failed, 3 total (100% completed) in 00:00:23
npm ERR! code ELIFECYCLE
npm ERR! errno 1
npm ERR! @ selenium-test: `wdio tests/selenium/wdio.conf.js`
npm ERR! Exit status 1
npm ERR!
npm ERR! Failed at the @ selenium-test script.
npm ERR! This is probably not a problem with npm. There is likely additional logging output above.
npm ERR! A complete log of this run can be found in:
npm ERR! /cache/_logs/2021-11-23T15_45_03_958Z-debug.log