Page MenuHomePhabricator
Paste P30954

Popups
ArchivedPublic

Authored by zeljkofilipin on Jul 7 2022, 2:52 PM.
Tags
None
Referenced Files
F35310934: Popups
Jul 7 2022, 2:52 PM
Subscribers
None
> selenium-test
> for i in $(seq 1 100); do wdio ./tests/selenium/wdio.conf.js; done
Execution of 2 spec files started at 2022-07-07T13:42:30.954Z
[0-0] RUNNING in chrome - /tests/selenium/specs/page_previews.js
[0-0] AssertionError in "Dwelling on a valid page link Quickly hovering, abandoning and re-hovering a link shows page preview"
AssertionError [ERR_ASSERTION]: Page preview is shown.
at Context.<anonymous> (/home/z/Documents/gerrit/mediawiki/core/extensions/Popups/tests/selenium/specs/page_previews.js:31:3)
[0-0] FAILED in chrome - /tests/selenium/specs/page_previews.js
[0-1] RUNNING in chrome - /tests/selenium/specs/reference_previews.js
[0-1] PASSED in chrome - /tests/selenium/specs/reference_previews.js
"dot" Reporter:
..F....
Spec Files: 1 passed, 1 failed, 2 total (100% completed) in 00:00:16
Execution of 2 spec files started at 2022-07-07T13:42:48.410Z
[0-0] RUNNING in chrome - /tests/selenium/specs/page_previews.js
[0-0] PASSED in chrome - /tests/selenium/specs/page_previews.js
[0-1] RUNNING in chrome - /tests/selenium/specs/reference_previews.js
[0-1] PASSED in chrome - /tests/selenium/specs/reference_previews.js
"dot" Reporter:
.......
Spec Files: 2 passed, 2 total (100% completed) in 00:00:16
Execution of 2 spec files started at 2022-07-07T13:43:06.292Z
[0-0] RUNNING in chrome - /tests/selenium/specs/page_previews.js
[0-0] PASSED in chrome - /tests/selenium/specs/page_previews.js
[0-1] RUNNING in chrome - /tests/selenium/specs/reference_previews.js
[0-1] PASSED in chrome - /tests/selenium/specs/reference_previews.js
"dot" Reporter:
.......
Spec Files: 2 passed, 2 total (100% completed) in 00:00:16
Execution of 2 spec files started at 2022-07-07T13:43:23.939Z
[0-0] RUNNING in chrome - /tests/selenium/specs/page_previews.js
[0-0] AssertionError in "Dwelling on a valid page link Quickly hovering, abandoning and re-hovering a link shows page preview"
AssertionError [ERR_ASSERTION]: Page preview is shown.
at Context.<anonymous> (/home/z/Documents/gerrit/mediawiki/core/extensions/Popups/tests/selenium/specs/page_previews.js:31:3)
[0-0] FAILED in chrome - /tests/selenium/specs/page_previews.js
[0-1] RUNNING in chrome - /tests/selenium/specs/reference_previews.js
[0-1] PASSED in chrome - /tests/selenium/specs/reference_previews.js
"dot" Reporter:
..F....
Spec Files: 1 passed, 1 failed, 2 total (100% completed) in 00:00:16
Execution of 2 spec files started at 2022-07-07T13:43:41.564Z
[0-0] RUNNING in chrome - /tests/selenium/specs/page_previews.js
[0-0] AssertionError in "Dwelling on a valid page link Quickly hovering, abandoning and re-hovering a link shows page preview"
AssertionError [ERR_ASSERTION]: Page preview is shown.
at Context.<anonymous> (/home/z/Documents/gerrit/mediawiki/core/extensions/Popups/tests/selenium/specs/page_previews.js:31:3)
[0-0] FAILED in chrome - /tests/selenium/specs/page_previews.js
[0-1] RUNNING in chrome - /tests/selenium/specs/reference_previews.js
[0-1] PASSED in chrome - /tests/selenium/specs/reference_previews.js
"dot" Reporter:
..F....
Spec Files: 1 passed, 1 failed, 2 total (100% completed) in 00:00:16
Execution of 2 spec files started at 2022-07-07T13:43:59.190Z
[0-0] RUNNING in chrome - /tests/selenium/specs/page_previews.js
[0-0] AssertionError in "Dwelling on a valid page link Quickly hovering, abandoning and re-hovering a link shows page preview"
AssertionError [ERR_ASSERTION]: Page preview is shown.
at Context.<anonymous> (/home/z/Documents/gerrit/mediawiki/core/extensions/Popups/tests/selenium/specs/page_previews.js:31:3)
[0-0] FAILED in chrome - /tests/selenium/specs/page_previews.js
[0-1] RUNNING in chrome - /tests/selenium/specs/reference_previews.js
[0-1] PASSED in chrome - /tests/selenium/specs/reference_previews.js
"dot" Reporter:
..F....
Spec Files: 1 passed, 1 failed, 2 total (100% completed) in 00:00:16
Execution of 2 spec files started at 2022-07-07T13:44:16.845Z
[0-0] RUNNING in chrome - /tests/selenium/specs/page_previews.js
[0-0] PASSED in chrome - /tests/selenium/specs/page_previews.js
[0-1] RUNNING in chrome - /tests/selenium/specs/reference_previews.js
[0-1] PASSED in chrome - /tests/selenium/specs/reference_previews.js
"dot" Reporter:
.......
Spec Files: 2 passed, 2 total (100% completed) in 00:00:16
Execution of 2 spec files started at 2022-07-07T13:44:34.451Z
[0-0] RUNNING in chrome - /tests/selenium/specs/page_previews.js
[0-0] PASSED in chrome - /tests/selenium/specs/page_previews.js
[0-1] RUNNING in chrome - /tests/selenium/specs/reference_previews.js
[0-1] PASSED in chrome - /tests/selenium/specs/reference_previews.js
"dot" Reporter:
.......
Spec Files: 2 passed, 2 total (100% completed) in 00:00:16
Execution of 2 spec files started at 2022-07-07T13:44:52.087Z
[0-0] RUNNING in chrome - /tests/selenium/specs/page_previews.js
[0-0] PASSED in chrome - /tests/selenium/specs/page_previews.js
[0-1] RUNNING in chrome - /tests/selenium/specs/reference_previews.js
[0-1] PASSED in chrome - /tests/selenium/specs/reference_previews.js
"dot" Reporter:
.......
Spec Files: 2 passed, 2 total (100% completed) in 00:00:16
Execution of 2 spec files started at 2022-07-07T13:45:09.633Z
[0-0] RUNNING in chrome - /tests/selenium/specs/page_previews.js
[0-0] AssertionError in "Dwelling on a valid page link Quickly hovering, abandoning and re-hovering a link shows page preview"
AssertionError [ERR_ASSERTION]: Page preview is shown.
at Context.<anonymous> (/home/z/Documents/gerrit/mediawiki/core/extensions/Popups/tests/selenium/specs/page_previews.js:31:3)
[0-0] FAILED in chrome - /tests/selenium/specs/page_previews.js
[0-1] RUNNING in chrome - /tests/selenium/specs/reference_previews.js
[0-1] PASSED in chrome - /tests/selenium/specs/reference_previews.js
"dot" Reporter:
..F....
Spec Files: 1 passed, 1 failed, 2 total (100% completed) in 00:00:16
Execution of 2 spec files started at 2022-07-07T13:45:27.168Z
[0-0] RUNNING in chrome - /tests/selenium/specs/page_previews.js
[0-0] AssertionError in "Dwelling on a valid page link Quickly hovering, abandoning and re-hovering a link shows page preview"
AssertionError [ERR_ASSERTION]: Page preview is shown.
at Context.<anonymous> (/home/z/Documents/gerrit/mediawiki/core/extensions/Popups/tests/selenium/specs/page_previews.js:31:3)
[0-0] FAILED in chrome - /tests/selenium/specs/page_previews.js
[0-1] RUNNING in chrome - /tests/selenium/specs/reference_previews.js
[0-1] PASSED in chrome - /tests/selenium/specs/reference_previews.js
"dot" Reporter:
..F....
Spec Files: 1 passed, 1 failed, 2 total (100% completed) in 00:00:16
Execution of 2 spec files started at 2022-07-07T13:45:44.911Z
[0-0] RUNNING in chrome - /tests/selenium/specs/page_previews.js
[0-0] PASSED in chrome - /tests/selenium/specs/page_previews.js
[0-1] RUNNING in chrome - /tests/selenium/specs/reference_previews.js
[0-1] PASSED in chrome - /tests/selenium/specs/reference_previews.js
"dot" Reporter:
.......
Spec Files: 2 passed, 2 total (100% completed) in 00:00:16
Execution of 2 spec files started at 2022-07-07T13:46:02.450Z
[0-0] RUNNING in chrome - /tests/selenium/specs/page_previews.js
[0-0] PASSED in chrome - /tests/selenium/specs/page_previews.js
[0-1] RUNNING in chrome - /tests/selenium/specs/reference_previews.js
[0-1] PASSED in chrome - /tests/selenium/specs/reference_previews.js
"dot" Reporter:
.......
Spec Files: 2 passed, 2 total (100% completed) in 00:00:16
Execution of 2 spec files started at 2022-07-07T13:46:20.939Z
[0-0] RUNNING in chrome - /tests/selenium/specs/page_previews.js
[0-0] PASSED in chrome - /tests/selenium/specs/page_previews.js
[0-1] RUNNING in chrome - /tests/selenium/specs/reference_previews.js
[0-1] PASSED in chrome - /tests/selenium/specs/reference_previews.js
"dot" Reporter:
.......
Spec Files: 2 passed, 2 total (100% completed) in 00:00:17
Execution of 2 spec files started at 2022-07-07T13:46:40.108Z
[0-0] RUNNING in chrome - /tests/selenium/specs/page_previews.js
[0-0] PASSED in chrome - /tests/selenium/specs/page_previews.js
[0-1] RUNNING in chrome - /tests/selenium/specs/reference_previews.js
[0-1] PASSED in chrome - /tests/selenium/specs/reference_previews.js
"dot" Reporter:
.......
Spec Files: 2 passed, 2 total (100% completed) in 00:00:17
Execution of 2 spec files started at 2022-07-07T13:46:59.152Z
[0-0] RUNNING in chrome - /tests/selenium/specs/page_previews.js
[0-0] PASSED in chrome - /tests/selenium/specs/page_previews.js
[0-1] RUNNING in chrome - /tests/selenium/specs/reference_previews.js
[0-1] PASSED in chrome - /tests/selenium/specs/reference_previews.js
"dot" Reporter:
.......
Spec Files: 2 passed, 2 total (100% completed) in 00:00:17
Execution of 2 spec files started at 2022-07-07T13:47:18.077Z
[0-0] RUNNING in chrome - /tests/selenium/specs/page_previews.js
[0-0] AssertionError in "Dwelling on a valid page link Quickly hovering, abandoning and re-hovering a link shows page preview"
AssertionError [ERR_ASSERTION]: Page preview is shown.
at Context.<anonymous> (/home/z/Documents/gerrit/mediawiki/core/extensions/Popups/tests/selenium/specs/page_previews.js:31:3)
[0-0] FAILED in chrome - /tests/selenium/specs/page_previews.js
[0-1] RUNNING in chrome - /tests/selenium/specs/reference_previews.js
[0-1] PASSED in chrome - /tests/selenium/specs/reference_previews.js
"dot" Reporter:
..F....
Spec Files: 1 passed, 1 failed, 2 total (100% completed) in 00:00:17
Execution of 2 spec files started at 2022-07-07T13:47:36.715Z
[0-0] RUNNING in chrome - /tests/selenium/specs/page_previews.js
[0-0] PASSED in chrome - /tests/selenium/specs/page_previews.js
[0-1] RUNNING in chrome - /tests/selenium/specs/reference_previews.js
[0-1] PASSED in chrome - /tests/selenium/specs/reference_previews.js
"dot" Reporter:
.......
Spec Files: 2 passed, 2 total (100% completed) in 00:00:17
Execution of 2 spec files started at 2022-07-07T13:47:56.011Z
[0-0] RUNNING in chrome - /tests/selenium/specs/page_previews.js
[0-0] AssertionError in "Dwelling on a valid page link Quickly hovering, abandoning and re-hovering a link shows page preview"
AssertionError [ERR_ASSERTION]: Page preview is shown.
at Context.<anonymous> (/home/z/Documents/gerrit/mediawiki/core/extensions/Popups/tests/selenium/specs/page_previews.js:31:3)
[0-0] FAILED in chrome - /tests/selenium/specs/page_previews.js
[0-1] RUNNING in chrome - /tests/selenium/specs/reference_previews.js
[0-1] PASSED in chrome - /tests/selenium/specs/reference_previews.js
"dot" Reporter:
..F....
Spec Files: 1 passed, 1 failed, 2 total (100% completed) in 00:00:16
Execution of 2 spec files started at 2022-07-07T13:48:14.356Z
[0-0] RUNNING in chrome - /tests/selenium/specs/page_previews.js
[0-0] AssertionError in "Dwelling on a valid page link Quickly hovering, abandoning and re-hovering a link shows page preview"
AssertionError [ERR_ASSERTION]: Page preview is shown.
at Context.<anonymous> (/home/z/Documents/gerrit/mediawiki/core/extensions/Popups/tests/selenium/specs/page_previews.js:31:3)
[0-0] FAILED in chrome - /tests/selenium/specs/page_previews.js
[0-1] RUNNING in chrome - /tests/selenium/specs/reference_previews.js
[0-1] PASSED in chrome - /tests/selenium/specs/reference_previews.js
"dot" Reporter:
..F....
Spec Files: 1 passed, 1 failed, 2 total (100% completed) in 00:00:17
Execution of 2 spec files started at 2022-07-07T13:48:33.696Z
[0-0] RUNNING in chrome - /tests/selenium/specs/page_previews.js
[0-0] PASSED in chrome - /tests/selenium/specs/page_previews.js
[0-1] RUNNING in chrome - /tests/selenium/specs/reference_previews.js
[0-1] PASSED in chrome - /tests/selenium/specs/reference_previews.js
"dot" Reporter:
.......
Spec Files: 2 passed, 2 total (100% completed) in 00:00:17
Execution of 2 spec files started at 2022-07-07T13:48:52.672Z
[0-0] RUNNING in chrome - /tests/selenium/specs/page_previews.js
[0-0] PASSED in chrome - /tests/selenium/specs/page_previews.js
[0-1] RUNNING in chrome - /tests/selenium/specs/reference_previews.js
[0-1] PASSED in chrome - /tests/selenium/specs/reference_previews.js
"dot" Reporter:
.......
Spec Files: 2 passed, 2 total (100% completed) in 00:00:17
Execution of 2 spec files started at 2022-07-07T13:49:12.031Z
[0-0] RUNNING in chrome - /tests/selenium/specs/page_previews.js
[0-0] PASSED in chrome - /tests/selenium/specs/page_previews.js
[0-1] RUNNING in chrome - /tests/selenium/specs/reference_previews.js
[0-1] PASSED in chrome - /tests/selenium/specs/reference_previews.js
"dot" Reporter:
.......
Spec Files: 2 passed, 2 total (100% completed) in 00:00:17
Execution of 2 spec files started at 2022-07-07T13:49:30.730Z
[0-0] RUNNING in chrome - /tests/selenium/specs/page_previews.js
[0-0] PASSED in chrome - /tests/selenium/specs/page_previews.js
[0-1] RUNNING in chrome - /tests/selenium/specs/reference_previews.js
[0-1] PASSED in chrome - /tests/selenium/specs/reference_previews.js
"dot" Reporter:
.......
Spec Files: 2 passed, 2 total (100% completed) in 00:00:16
Execution of 2 spec files started at 2022-07-07T13:49:48.605Z
[0-0] RUNNING in chrome - /tests/selenium/specs/page_previews.js
[0-0] PASSED in chrome - /tests/selenium/specs/page_previews.js
[0-1] RUNNING in chrome - /tests/selenium/specs/reference_previews.js
[0-1] PASSED in chrome - /tests/selenium/specs/reference_previews.js
"dot" Reporter:
.......
Spec Files: 2 passed, 2 total (100% completed) in 00:00:17
Execution of 2 spec files started at 2022-07-07T13:50:07.543Z
[0-0] RUNNING in chrome - /tests/selenium/specs/page_previews.js
[0-0] PASSED in chrome - /tests/selenium/specs/page_previews.js
[0-1] RUNNING in chrome - /tests/selenium/specs/reference_previews.js
[0-1] PASSED in chrome - /tests/selenium/specs/reference_previews.js
"dot" Reporter:
.......
Spec Files: 2 passed, 2 total (100% completed) in 00:00:16
Execution of 2 spec files started at 2022-07-07T13:50:25.930Z
[0-0] RUNNING in chrome - /tests/selenium/specs/page_previews.js
[0-0] PASSED in chrome - /tests/selenium/specs/page_previews.js
[0-1] RUNNING in chrome - /tests/selenium/specs/reference_previews.js
[0-1] PASSED in chrome - /tests/selenium/specs/reference_previews.js
"dot" Reporter:
.......
Spec Files: 2 passed, 2 total (100% completed) in 00:00:16
Execution of 2 spec files started at 2022-07-07T13:50:43.555Z
[0-0] RUNNING in chrome - /tests/selenium/specs/page_previews.js
[0-0] AssertionError in "Dwelling on a valid page link Quickly hovering, abandoning and re-hovering a link shows page preview"
AssertionError [ERR_ASSERTION]: Page preview is shown.
at Context.<anonymous> (/home/z/Documents/gerrit/mediawiki/core/extensions/Popups/tests/selenium/specs/page_previews.js:31:3)
[0-0] FAILED in chrome - /tests/selenium/specs/page_previews.js
[0-1] RUNNING in chrome - /tests/selenium/specs/reference_previews.js
[0-1] PASSED in chrome - /tests/selenium/specs/reference_previews.js
"dot" Reporter:
..F....
Spec Files: 1 passed, 1 failed, 2 total (100% completed) in 00:00:16
Execution of 2 spec files started at 2022-07-07T13:51:01.619Z
[0-0] RUNNING in chrome - /tests/selenium/specs/page_previews.js
[0-0] PASSED in chrome - /tests/selenium/specs/page_previews.js
[0-1] RUNNING in chrome - /tests/selenium/specs/reference_previews.js
[0-1] PASSED in chrome - /tests/selenium/specs/reference_previews.js
"dot" Reporter:
.......
Spec Files: 2 passed, 2 total (100% completed) in 00:00:16
Execution of 2 spec files started at 2022-07-07T13:51:19.234Z
[0-0] RUNNING in chrome - /tests/selenium/specs/page_previews.js
[0-0] PASSED in chrome - /tests/selenium/specs/page_previews.js
[0-1] RUNNING in chrome - /tests/selenium/specs/reference_previews.js
[0-1] PASSED in chrome - /tests/selenium/specs/reference_previews.js
"dot" Reporter:
.......
Spec Files: 2 passed, 2 total (100% completed) in 00:00:16
Execution of 2 spec files started at 2022-07-07T13:51:37.028Z
[0-0] RUNNING in chrome - /tests/selenium/specs/page_previews.js
[0-0] PASSED in chrome - /tests/selenium/specs/page_previews.js
[0-1] RUNNING in chrome - /tests/selenium/specs/reference_previews.js
[0-1] PASSED in chrome - /tests/selenium/specs/reference_previews.js
"dot" Reporter:
.......
Spec Files: 2 passed, 2 total (100% completed) in 00:00:16
Execution of 2 spec files started at 2022-07-07T13:51:54.888Z
[0-0] RUNNING in chrome - /tests/selenium/specs/page_previews.js
[0-0] PASSED in chrome - /tests/selenium/specs/page_previews.js
[0-1] RUNNING in chrome - /tests/selenium/specs/reference_previews.js
[0-1] PASSED in chrome - /tests/selenium/specs/reference_previews.js
"dot" Reporter:
.......
Spec Files: 2 passed, 2 total (100% completed) in 00:00:16
Execution of 2 spec files started at 2022-07-07T13:52:12.476Z
[0-0] RUNNING in chrome - /tests/selenium/specs/page_previews.js
[0-0] PASSED in chrome - /tests/selenium/specs/page_previews.js
[0-1] RUNNING in chrome - /tests/selenium/specs/reference_previews.js
[0-1] PASSED in chrome - /tests/selenium/specs/reference_previews.js
"dot" Reporter:
.......
Spec Files: 2 passed, 2 total (100% completed) in 00:00:16
Execution of 2 spec files started at 2022-07-07T13:52:30.309Z
[0-0] RUNNING in chrome - /tests/selenium/specs/page_previews.js
[0-0] PASSED in chrome - /tests/selenium/specs/page_previews.js
[0-1] RUNNING in chrome - /tests/selenium/specs/reference_previews.js
[0-1] PASSED in chrome - /tests/selenium/specs/reference_previews.js
"dot" Reporter:
.......
Spec Files: 2 passed, 2 total (100% completed) in 00:00:16
Execution of 2 spec files started at 2022-07-07T13:52:48.131Z
[0-0] RUNNING in chrome - /tests/selenium/specs/page_previews.js
[0-0] PASSED in chrome - /tests/selenium/specs/page_previews.js
[0-1] RUNNING in chrome - /tests/selenium/specs/reference_previews.js
[0-1] PASSED in chrome - /tests/selenium/specs/reference_previews.js
"dot" Reporter:
.......
Spec Files: 2 passed, 2 total (100% completed) in 00:00:16
Execution of 2 spec files started at 2022-07-07T13:53:06.086Z
[0-0] RUNNING in chrome - /tests/selenium/specs/page_previews.js
[0-0] PASSED in chrome - /tests/selenium/specs/page_previews.js
[0-1] RUNNING in chrome - /tests/selenium/specs/reference_previews.js
[0-1] PASSED in chrome - /tests/selenium/specs/reference_previews.js
"dot" Reporter:
.......
Spec Files: 2 passed, 2 total (100% completed) in 00:00:16
Execution of 2 spec files started at 2022-07-07T13:53:24.067Z
[0-0] RUNNING in chrome - /tests/selenium/specs/page_previews.js
[0-0] PASSED in chrome - /tests/selenium/specs/page_previews.js
[0-1] RUNNING in chrome - /tests/selenium/specs/reference_previews.js
[0-1] PASSED in chrome - /tests/selenium/specs/reference_previews.js
"dot" Reporter:
.......
Spec Files: 2 passed, 2 total (100% completed) in 00:00:16
Execution of 2 spec files started at 2022-07-07T13:53:41.906Z
[0-0] RUNNING in chrome - /tests/selenium/specs/page_previews.js
[0-0] PASSED in chrome - /tests/selenium/specs/page_previews.js
[0-1] RUNNING in chrome - /tests/selenium/specs/reference_previews.js
[0-1] PASSED in chrome - /tests/selenium/specs/reference_previews.js
"dot" Reporter:
.......
Spec Files: 2 passed, 2 total (100% completed) in 00:00:16
Execution of 2 spec files started at 2022-07-07T13:53:59.813Z
[0-0] RUNNING in chrome - /tests/selenium/specs/page_previews.js
[0-0] PASSED in chrome - /tests/selenium/specs/page_previews.js
[0-1] RUNNING in chrome - /tests/selenium/specs/reference_previews.js
[0-1] PASSED in chrome - /tests/selenium/specs/reference_previews.js
"dot" Reporter:
.......
Spec Files: 2 passed, 2 total (100% completed) in 00:00:16
Execution of 2 spec files started at 2022-07-07T13:54:17.873Z
[0-0] RUNNING in chrome - /tests/selenium/specs/page_previews.js
[0-0] PASSED in chrome - /tests/selenium/specs/page_previews.js
[0-1] RUNNING in chrome - /tests/selenium/specs/reference_previews.js
[0-1] PASSED in chrome - /tests/selenium/specs/reference_previews.js
"dot" Reporter:
.......
Spec Files: 2 passed, 2 total (100% completed) in 00:00:16
Execution of 2 spec files started at 2022-07-07T13:54:35.621Z
[0-0] RUNNING in chrome - /tests/selenium/specs/page_previews.js
[0-0] PASSED in chrome - /tests/selenium/specs/page_previews.js
[0-1] RUNNING in chrome - /tests/selenium/specs/reference_previews.js
[0-1] PASSED in chrome - /tests/selenium/specs/reference_previews.js
"dot" Reporter:
.......
Spec Files: 2 passed, 2 total (100% completed) in 00:00:16
Execution of 2 spec files started at 2022-07-07T13:54:53.556Z
[0-0] RUNNING in chrome - /tests/selenium/specs/page_previews.js
[0-0] PASSED in chrome - /tests/selenium/specs/page_previews.js
[0-1] RUNNING in chrome - /tests/selenium/specs/reference_previews.js
[0-1] PASSED in chrome - /tests/selenium/specs/reference_previews.js
"dot" Reporter:
.......
Spec Files: 2 passed, 2 total (100% completed) in 00:00:16
Execution of 2 spec files started at 2022-07-07T13:55:11.638Z
[0-0] RUNNING in chrome - /tests/selenium/specs/page_previews.js
[0-0] PASSED in chrome - /tests/selenium/specs/page_previews.js
[0-1] RUNNING in chrome - /tests/selenium/specs/reference_previews.js
[0-1] PASSED in chrome - /tests/selenium/specs/reference_previews.js
"dot" Reporter:
.......
Spec Files: 2 passed, 2 total (100% completed) in 00:00:16
Execution of 2 spec files started at 2022-07-07T13:55:29.667Z
[0-0] RUNNING in chrome - /tests/selenium/specs/page_previews.js
[0-0] PASSED in chrome - /tests/selenium/specs/page_previews.js
[0-1] RUNNING in chrome - /tests/selenium/specs/reference_previews.js
[0-1] PASSED in chrome - /tests/selenium/specs/reference_previews.js
"dot" Reporter:
.......
Spec Files: 2 passed, 2 total (100% completed) in 00:00:16
Execution of 2 spec files started at 2022-07-07T13:55:47.485Z
[0-0] RUNNING in chrome - /tests/selenium/specs/page_previews.js
[0-0] PASSED in chrome - /tests/selenium/specs/page_previews.js
[0-1] RUNNING in chrome - /tests/selenium/specs/reference_previews.js
[0-1] PASSED in chrome - /tests/selenium/specs/reference_previews.js
"dot" Reporter:
.......
Spec Files: 2 passed, 2 total (100% completed) in 00:00:16
Execution of 2 spec files started at 2022-07-07T13:56:05.474Z
[0-0] RUNNING in chrome - /tests/selenium/specs/page_previews.js
[0-0] PASSED in chrome - /tests/selenium/specs/page_previews.js
[0-1] RUNNING in chrome - /tests/selenium/specs/reference_previews.js
[0-1] PASSED in chrome - /tests/selenium/specs/reference_previews.js
"dot" Reporter:
.......
Spec Files: 2 passed, 2 total (100% completed) in 00:00:16
Execution of 2 spec files started at 2022-07-07T13:56:23.232Z
[0-0] RUNNING in chrome - /tests/selenium/specs/page_previews.js
[0-0] PASSED in chrome - /tests/selenium/specs/page_previews.js
[0-1] RUNNING in chrome - /tests/selenium/specs/reference_previews.js
[0-1] PASSED in chrome - /tests/selenium/specs/reference_previews.js
"dot" Reporter:
.......
Spec Files: 2 passed, 2 total (100% completed) in 00:00:16
Execution of 2 spec files started at 2022-07-07T13:56:41.147Z
[0-0] RUNNING in chrome - /tests/selenium/specs/page_previews.js
[0-0] PASSED in chrome - /tests/selenium/specs/page_previews.js
[0-1] RUNNING in chrome - /tests/selenium/specs/reference_previews.js
[0-1] PASSED in chrome - /tests/selenium/specs/reference_previews.js
"dot" Reporter:
.......
Spec Files: 2 passed, 2 total (100% completed) in 00:00:16
Execution of 2 spec files started at 2022-07-07T13:56:59.127Z
[0-0] RUNNING in chrome - /tests/selenium/specs/page_previews.js
[0-0] PASSED in chrome - /tests/selenium/specs/page_previews.js
[0-1] RUNNING in chrome - /tests/selenium/specs/reference_previews.js
[0-1] PASSED in chrome - /tests/selenium/specs/reference_previews.js
"dot" Reporter:
.......
Spec Files: 2 passed, 2 total (100% completed) in 00:00:16
Execution of 2 spec files started at 2022-07-07T13:57:17.136Z
[0-0] RUNNING in chrome - /tests/selenium/specs/page_previews.js
[0-0] PASSED in chrome - /tests/selenium/specs/page_previews.js
[0-1] RUNNING in chrome - /tests/selenium/specs/reference_previews.js
[0-1] PASSED in chrome - /tests/selenium/specs/reference_previews.js
"dot" Reporter:
.......
Spec Files: 2 passed, 2 total (100% completed) in 00:00:16
Execution of 2 spec files started at 2022-07-07T13:57:35.017Z
[0-0] RUNNING in chrome - /tests/selenium/specs/page_previews.js
[0-0] PASSED in chrome - /tests/selenium/specs/page_previews.js
[0-1] RUNNING in chrome - /tests/selenium/specs/reference_previews.js
[0-1] PASSED in chrome - /tests/selenium/specs/reference_previews.js
"dot" Reporter:
.......
Spec Files: 2 passed, 2 total (100% completed) in 00:00:16
Execution of 2 spec files started at 2022-07-07T13:57:53.108Z
[0-0] RUNNING in chrome - /tests/selenium/specs/page_previews.js
[0-0] PASSED in chrome - /tests/selenium/specs/page_previews.js
[0-1] RUNNING in chrome - /tests/selenium/specs/reference_previews.js
[0-1] PASSED in chrome - /tests/selenium/specs/reference_previews.js
"dot" Reporter:
.......
Spec Files: 2 passed, 2 total (100% completed) in 00:00:16
Execution of 2 spec files started at 2022-07-07T13:58:11.079Z
[0-0] RUNNING in chrome - /tests/selenium/specs/page_previews.js
[0-0] PASSED in chrome - /tests/selenium/specs/page_previews.js
[0-1] RUNNING in chrome - /tests/selenium/specs/reference_previews.js
[0-1] PASSED in chrome - /tests/selenium/specs/reference_previews.js
"dot" Reporter:
.......
Spec Files: 2 passed, 2 total (100% completed) in 00:00:16
Execution of 2 spec files started at 2022-07-07T13:58:28.995Z
[0-0] RUNNING in chrome - /tests/selenium/specs/page_previews.js
[0-0] PASSED in chrome - /tests/selenium/specs/page_previews.js
[0-1] RUNNING in chrome - /tests/selenium/specs/reference_previews.js
[0-1] PASSED in chrome - /tests/selenium/specs/reference_previews.js
"dot" Reporter:
.......
Spec Files: 2 passed, 2 total (100% completed) in 00:00:16
Execution of 2 spec files started at 2022-07-07T13:58:46.882Z
[0-0] RUNNING in chrome - /tests/selenium/specs/page_previews.js
[0-0] PASSED in chrome - /tests/selenium/specs/page_previews.js
[0-1] RUNNING in chrome - /tests/selenium/specs/reference_previews.js
[0-1] PASSED in chrome - /tests/selenium/specs/reference_previews.js
"dot" Reporter:
.......
Spec Files: 2 passed, 2 total (100% completed) in 00:00:16
Execution of 2 spec files started at 2022-07-07T13:59:04.987Z
[0-0] RUNNING in chrome - /tests/selenium/specs/page_previews.js
[0-0] PASSED in chrome - /tests/selenium/specs/page_previews.js
[0-1] RUNNING in chrome - /tests/selenium/specs/reference_previews.js
[0-1] PASSED in chrome - /tests/selenium/specs/reference_previews.js
"dot" Reporter:
.......
Spec Files: 2 passed, 2 total (100% completed) in 00:00:16
Execution of 2 spec files started at 2022-07-07T13:59:22.989Z
[0-0] RUNNING in chrome - /tests/selenium/specs/page_previews.js
[0-0] PASSED in chrome - /tests/selenium/specs/page_previews.js
[0-1] RUNNING in chrome - /tests/selenium/specs/reference_previews.js
[0-1] PASSED in chrome - /tests/selenium/specs/reference_previews.js
"dot" Reporter:
.......
Spec Files: 2 passed, 2 total (100% completed) in 00:00:16
Execution of 2 spec files started at 2022-07-07T13:59:40.912Z
[0-0] RUNNING in chrome - /tests/selenium/specs/page_previews.js
[0-0] PASSED in chrome - /tests/selenium/specs/page_previews.js
[0-1] RUNNING in chrome - /tests/selenium/specs/reference_previews.js
[0-1] PASSED in chrome - /tests/selenium/specs/reference_previews.js
"dot" Reporter:
.......
Spec Files: 2 passed, 2 total (100% completed) in 00:00:16
Execution of 2 spec files started at 2022-07-07T13:59:58.877Z
[0-0] RUNNING in chrome - /tests/selenium/specs/page_previews.js
[0-0] PASSED in chrome - /tests/selenium/specs/page_previews.js
[0-1] RUNNING in chrome - /tests/selenium/specs/reference_previews.js
[0-1] PASSED in chrome - /tests/selenium/specs/reference_previews.js
"dot" Reporter:
.......
Spec Files: 2 passed, 2 total (100% completed) in 00:00:16
Execution of 2 spec files started at 2022-07-07T14:00:16.774Z
[0-0] RUNNING in chrome - /tests/selenium/specs/page_previews.js
[0-0] PASSED in chrome - /tests/selenium/specs/page_previews.js
[0-1] RUNNING in chrome - /tests/selenium/specs/reference_previews.js
[0-1] PASSED in chrome - /tests/selenium/specs/reference_previews.js
"dot" Reporter:
.......
Spec Files: 2 passed, 2 total (100% completed) in 00:00:16
Execution of 2 spec files started at 2022-07-07T14:00:34.741Z
[0-0] RUNNING in chrome - /tests/selenium/specs/page_previews.js
[0-0] PASSED in chrome - /tests/selenium/specs/page_previews.js
[0-1] RUNNING in chrome - /tests/selenium/specs/reference_previews.js
[0-1] PASSED in chrome - /tests/selenium/specs/reference_previews.js
"dot" Reporter:
.......
Spec Files: 2 passed, 2 total (100% completed) in 00:00:16
Execution of 2 spec files started at 2022-07-07T14:00:52.752Z
[0-0] RUNNING in chrome - /tests/selenium/specs/page_previews.js
[0-0] PASSED in chrome - /tests/selenium/specs/page_previews.js
[0-1] RUNNING in chrome - /tests/selenium/specs/reference_previews.js
[0-1] PASSED in chrome - /tests/selenium/specs/reference_previews.js
"dot" Reporter:
.......
Spec Files: 2 passed, 2 total (100% completed) in 00:00:16
Execution of 2 spec files started at 2022-07-07T14:01:10.709Z
[0-0] RUNNING in chrome - /tests/selenium/specs/page_previews.js
[0-0] PASSED in chrome - /tests/selenium/specs/page_previews.js
[0-1] RUNNING in chrome - /tests/selenium/specs/reference_previews.js
[0-1] PASSED in chrome - /tests/selenium/specs/reference_previews.js
"dot" Reporter:
.......
Spec Files: 2 passed, 2 total (100% completed) in 00:00:16
Execution of 2 spec files started at 2022-07-07T14:01:28.832Z
[0-0] RUNNING in chrome - /tests/selenium/specs/page_previews.js
[0-0] PASSED in chrome - /tests/selenium/specs/page_previews.js
[0-1] RUNNING in chrome - /tests/selenium/specs/reference_previews.js
[0-1] PASSED in chrome - /tests/selenium/specs/reference_previews.js
"dot" Reporter:
.......
Spec Files: 2 passed, 2 total (100% completed) in 00:00:16
Execution of 2 spec files started at 2022-07-07T14:01:46.813Z
[0-0] RUNNING in chrome - /tests/selenium/specs/page_previews.js
[0-0] PASSED in chrome - /tests/selenium/specs/page_previews.js
[0-1] RUNNING in chrome - /tests/selenium/specs/reference_previews.js
[0-1] PASSED in chrome - /tests/selenium/specs/reference_previews.js
"dot" Reporter:
.......
Spec Files: 2 passed, 2 total (100% completed) in 00:00:16
Execution of 2 spec files started at 2022-07-07T14:02:04.825Z
[0-0] RUNNING in chrome - /tests/selenium/specs/page_previews.js
[0-0] AssertionError in "Dwelling on a valid page link I should see a page preview"
AssertionError [ERR_ASSERTION]: Page preview is shown.
at Context.<anonymous> (/home/z/Documents/gerrit/mediawiki/core/extensions/Popups/tests/selenium/specs/page_previews.js:18:3)
[0-0] FAILED in chrome - /tests/selenium/specs/page_previews.js
[0-1] RUNNING in chrome - /tests/selenium/specs/reference_previews.js
[0-1] PASSED in chrome - /tests/selenium/specs/reference_previews.js
"dot" Reporter:
F......
Spec Files: 1 passed, 1 failed, 2 total (100% completed) in 00:00:16
Execution of 2 spec files started at 2022-07-07T14:02:22.917Z
[0-0] RUNNING in chrome - /tests/selenium/specs/page_previews.js
[0-0] PASSED in chrome - /tests/selenium/specs/page_previews.js
[0-1] RUNNING in chrome - /tests/selenium/specs/reference_previews.js
[0-1] PASSED in chrome - /tests/selenium/specs/reference_previews.js
"dot" Reporter:
.......
Spec Files: 2 passed, 2 total (100% completed) in 00:00:16
Execution of 2 spec files started at 2022-07-07T14:02:41.029Z
[0-0] RUNNING in chrome - /tests/selenium/specs/page_previews.js
[0-0] PASSED in chrome - /tests/selenium/specs/page_previews.js
[0-1] RUNNING in chrome - /tests/selenium/specs/reference_previews.js
[0-1] PASSED in chrome - /tests/selenium/specs/reference_previews.js
"dot" Reporter:
.......
Spec Files: 2 passed, 2 total (100% completed) in 00:00:16
Execution of 2 spec files started at 2022-07-07T14:02:59.342Z
[0-0] RUNNING in chrome - /tests/selenium/specs/page_previews.js
[0-0] PASSED in chrome - /tests/selenium/specs/page_previews.js
[0-1] RUNNING in chrome - /tests/selenium/specs/reference_previews.js
[0-1] PASSED in chrome - /tests/selenium/specs/reference_previews.js
"dot" Reporter:
.......
Spec Files: 2 passed, 2 total (100% completed) in 00:00:16
Execution of 2 spec files started at 2022-07-07T14:03:17.381Z
[0-0] RUNNING in chrome - /tests/selenium/specs/page_previews.js
[0-0] PASSED in chrome - /tests/selenium/specs/page_previews.js
[0-1] RUNNING in chrome - /tests/selenium/specs/reference_previews.js
[0-1] PASSED in chrome - /tests/selenium/specs/reference_previews.js
"dot" Reporter:
.......
Spec Files: 2 passed, 2 total (100% completed) in 00:00:16
Execution of 2 spec files started at 2022-07-07T14:03:35.465Z
[0-0] RUNNING in chrome - /tests/selenium/specs/page_previews.js
[0-0] AssertionError in "Dwelling on a valid page link Quickly hovering, abandoning and re-hovering a link shows page preview"
AssertionError [ERR_ASSERTION]: Page preview is shown.
at Context.<anonymous> (/home/z/Documents/gerrit/mediawiki/core/extensions/Popups/tests/selenium/specs/page_previews.js:31:3)
[0-0] FAILED in chrome - /tests/selenium/specs/page_previews.js
[0-1] RUNNING in chrome - /tests/selenium/specs/reference_previews.js
[0-1] PASSED in chrome - /tests/selenium/specs/reference_previews.js
"dot" Reporter:
..F....
Spec Files: 1 passed, 1 failed, 2 total (100% completed) in 00:00:18
Execution of 2 spec files started at 2022-07-07T14:03:55.569Z
[0-0] RUNNING in chrome - /tests/selenium/specs/page_previews.js
[0-0] PASSED in chrome - /tests/selenium/specs/page_previews.js
[0-1] RUNNING in chrome - /tests/selenium/specs/reference_previews.js
[0-1] PASSED in chrome - /tests/selenium/specs/reference_previews.js
"dot" Reporter:
.......
Spec Files: 2 passed, 2 total (100% completed) in 00:00:16
Execution of 2 spec files started at 2022-07-07T14:04:13.713Z
[0-0] RUNNING in chrome - /tests/selenium/specs/page_previews.js
[0-0] PASSED in chrome - /tests/selenium/specs/page_previews.js
[0-1] RUNNING in chrome - /tests/selenium/specs/reference_previews.js
[0-1] PASSED in chrome - /tests/selenium/specs/reference_previews.js
"dot" Reporter:
.......
Spec Files: 2 passed, 2 total (100% completed) in 00:00:16
Execution of 2 spec files started at 2022-07-07T14:04:31.881Z
[0-0] RUNNING in chrome - /tests/selenium/specs/page_previews.js
[0-0] PASSED in chrome - /tests/selenium/specs/page_previews.js
[0-1] RUNNING in chrome - /tests/selenium/specs/reference_previews.js
[0-1] PASSED in chrome - /tests/selenium/specs/reference_previews.js
"dot" Reporter:
.......
Spec Files: 2 passed, 2 total (100% completed) in 00:00:16
Execution of 2 spec files started at 2022-07-07T14:04:50.160Z
[0-0] RUNNING in chrome - /tests/selenium/specs/page_previews.js
[0-0] PASSED in chrome - /tests/selenium/specs/page_previews.js
[0-1] RUNNING in chrome - /tests/selenium/specs/reference_previews.js
[0-1] PASSED in chrome - /tests/selenium/specs/reference_previews.js
"dot" Reporter:
.......
Spec Files: 2 passed, 2 total (100% completed) in 00:00:16
Execution of 2 spec files started at 2022-07-07T14:05:08.545Z
[0-0] RUNNING in chrome - /tests/selenium/specs/page_previews.js
[0-0] PASSED in chrome - /tests/selenium/specs/page_previews.js
[0-1] RUNNING in chrome - /tests/selenium/specs/reference_previews.js
[0-1] PASSED in chrome - /tests/selenium/specs/reference_previews.js
"dot" Reporter:
.......
Spec Files: 2 passed, 2 total (100% completed) in 00:00:16
Execution of 2 spec files started at 2022-07-07T14:05:26.478Z
[0-0] RUNNING in chrome - /tests/selenium/specs/page_previews.js
[0-0] AssertionError in "Dwelling on a valid page link I should see a page preview"
AssertionError [ERR_ASSERTION]: Page preview is shown.
at Context.<anonymous> (/home/z/Documents/gerrit/mediawiki/core/extensions/Popups/tests/selenium/specs/page_previews.js:18:3)
[0-0] FAILED in chrome - /tests/selenium/specs/page_previews.js
[0-1] RUNNING in chrome - /tests/selenium/specs/reference_previews.js
[0-1] PASSED in chrome - /tests/selenium/specs/reference_previews.js
"dot" Reporter:
F......
Spec Files: 1 passed, 1 failed, 2 total (100% completed) in 00:00:16
Execution of 2 spec files started at 2022-07-07T14:05:44.425Z
[0-0] RUNNING in chrome - /tests/selenium/specs/page_previews.js
[0-0] PASSED in chrome - /tests/selenium/specs/page_previews.js
[0-1] RUNNING in chrome - /tests/selenium/specs/reference_previews.js
[0-1] PASSED in chrome - /tests/selenium/specs/reference_previews.js
"dot" Reporter:
.......
Spec Files: 2 passed, 2 total (100% completed) in 00:00:16
Execution of 2 spec files started at 2022-07-07T14:06:02.665Z
[0-0] RUNNING in chrome - /tests/selenium/specs/page_previews.js
[0-0] PASSED in chrome - /tests/selenium/specs/page_previews.js
[0-1] RUNNING in chrome - /tests/selenium/specs/reference_previews.js
[0-1] PASSED in chrome - /tests/selenium/specs/reference_previews.js
"dot" Reporter:
.......
Spec Files: 2 passed, 2 total (100% completed) in 00:00:16
Execution of 2 spec files started at 2022-07-07T14:06:20.886Z
[0-0] RUNNING in chrome - /tests/selenium/specs/page_previews.js
[0-0] PASSED in chrome - /tests/selenium/specs/page_previews.js
[0-1] RUNNING in chrome - /tests/selenium/specs/reference_previews.js
[0-1] PASSED in chrome - /tests/selenium/specs/reference_previews.js
"dot" Reporter:
.......
Spec Files: 2 passed, 2 total (100% completed) in 00:00:18
Execution of 2 spec files started at 2022-07-07T14:06:41.386Z
[0-0] RUNNING in chrome - /tests/selenium/specs/page_previews.js
[0-0] PASSED in chrome - /tests/selenium/specs/page_previews.js
[0-1] RUNNING in chrome - /tests/selenium/specs/reference_previews.js
[0-1] PASSED in chrome - /tests/selenium/specs/reference_previews.js
"dot" Reporter:
.......
Spec Files: 2 passed, 2 total (100% completed) in 00:00:16
Execution of 2 spec files started at 2022-07-07T14:06:59.766Z
[0-0] RUNNING in chrome - /tests/selenium/specs/page_previews.js
[0-0] PASSED in chrome - /tests/selenium/specs/page_previews.js
[0-1] RUNNING in chrome - /tests/selenium/specs/reference_previews.js
[0-1] PASSED in chrome - /tests/selenium/specs/reference_previews.js
"dot" Reporter:
.......
Spec Files: 2 passed, 2 total (100% completed) in 00:00:16
Execution of 2 spec files started at 2022-07-07T14:07:17.906Z
[0-0] RUNNING in chrome - /tests/selenium/specs/page_previews.js
[0-0] PASSED in chrome - /tests/selenium/specs/page_previews.js
[0-1] RUNNING in chrome - /tests/selenium/specs/reference_previews.js
[0-1] PASSED in chrome - /tests/selenium/specs/reference_previews.js
"dot" Reporter:
.......
Spec Files: 2 passed, 2 total (100% completed) in 00:00:16
Execution of 2 spec files started at 2022-07-07T14:07:35.947Z
[0-0] RUNNING in chrome - /tests/selenium/specs/page_previews.js
[0-0] PASSED in chrome - /tests/selenium/specs/page_previews.js
[0-1] RUNNING in chrome - /tests/selenium/specs/reference_previews.js
[0-1] PASSED in chrome - /tests/selenium/specs/reference_previews.js
"dot" Reporter:
.......
Spec Files: 2 passed, 2 total (100% completed) in 00:00:16
Execution of 2 spec files started at 2022-07-07T14:07:54.210Z
[0-0] RUNNING in chrome - /tests/selenium/specs/page_previews.js
[0-0] PASSED in chrome - /tests/selenium/specs/page_previews.js
[0-1] RUNNING in chrome - /tests/selenium/specs/reference_previews.js
[0-1] PASSED in chrome - /tests/selenium/specs/reference_previews.js
"dot" Reporter:
.......
Spec Files: 2 passed, 2 total (100% completed) in 00:00:19
Execution of 2 spec files started at 2022-07-07T14:08:14.741Z
[0-0] RUNNING in chrome - /tests/selenium/specs/page_previews.js
[0-0] PASSED in chrome - /tests/selenium/specs/page_previews.js
[0-1] RUNNING in chrome - /tests/selenium/specs/reference_previews.js
[0-1] PASSED in chrome - /tests/selenium/specs/reference_previews.js
"dot" Reporter:
.......
Spec Files: 2 passed, 2 total (100% completed) in 00:00:16
Execution of 2 spec files started at 2022-07-07T14:08:33.180Z
[0-0] RUNNING in chrome - /tests/selenium/specs/page_previews.js
[0-0] AssertionError in "Dwelling on a valid page link Quickly hovering, abandoning and re-hovering a link shows page preview"
AssertionError [ERR_ASSERTION]: Page preview is shown.
at Context.<anonymous> (/home/z/Documents/gerrit/mediawiki/core/extensions/Popups/tests/selenium/specs/page_previews.js:31:3)
[0-0] FAILED in chrome - /tests/selenium/specs/page_previews.js
[0-1] RUNNING in chrome - /tests/selenium/specs/reference_previews.js
[0-1] PASSED in chrome - /tests/selenium/specs/reference_previews.js
"dot" Reporter:
..F....
Spec Files: 1 passed, 1 failed, 2 total (100% completed) in 00:00:17
Execution of 2 spec files started at 2022-07-07T14:08:52.218Z
[0-0] RUNNING in chrome - /tests/selenium/specs/page_previews.js
[0-0] PASSED in chrome - /tests/selenium/specs/page_previews.js
[0-1] RUNNING in chrome - /tests/selenium/specs/reference_previews.js
[0-1] PASSED in chrome - /tests/selenium/specs/reference_previews.js
"dot" Reporter:
.......
Spec Files: 2 passed, 2 total (100% completed) in 00:00:17
Execution of 2 spec files started at 2022-07-07T14:09:11.335Z
[0-0] RUNNING in chrome - /tests/selenium/specs/page_previews.js
[0-0] PASSED in chrome - /tests/selenium/specs/page_previews.js
[0-1] RUNNING in chrome - /tests/selenium/specs/reference_previews.js
[0-1] PASSED in chrome - /tests/selenium/specs/reference_previews.js
"dot" Reporter:
.......
Spec Files: 2 passed, 2 total (100% completed) in 00:00:17
Execution of 2 spec files started at 2022-07-07T14:09:29.903Z
[0-0] RUNNING in chrome - /tests/selenium/specs/page_previews.js
[0-0] AssertionError in "Dwelling on a valid page link Quickly hovering, abandoning and re-hovering a link shows page preview"
AssertionError [ERR_ASSERTION]: Page preview is shown.
at Context.<anonymous> (/home/z/Documents/gerrit/mediawiki/core/extensions/Popups/tests/selenium/specs/page_previews.js:31:3)
[0-0] FAILED in chrome - /tests/selenium/specs/page_previews.js
[0-1] RUNNING in chrome - /tests/selenium/specs/reference_previews.js
[0-1] PASSED in chrome - /tests/selenium/specs/reference_previews.js
"dot" Reporter:
..F....
Spec Files: 1 passed, 1 failed, 2 total (100% completed) in 00:00:17
Execution of 2 spec files started at 2022-07-07T14:09:48.509Z
[0-0] RUNNING in chrome - /tests/selenium/specs/page_previews.js
[0-0] PASSED in chrome - /tests/selenium/specs/page_previews.js
[0-1] RUNNING in chrome - /tests/selenium/specs/reference_previews.js
[0-1] PASSED in chrome - /tests/selenium/specs/reference_previews.js
"dot" Reporter:
.......
Spec Files: 2 passed, 2 total (100% completed) in 00:00:16
Execution of 2 spec files started at 2022-07-07T14:10:06.996Z
[0-0] RUNNING in chrome - /tests/selenium/specs/page_previews.js
[0-0] PASSED in chrome - /tests/selenium/specs/page_previews.js
[0-1] RUNNING in chrome - /tests/selenium/specs/reference_previews.js
[0-1] PASSED in chrome - /tests/selenium/specs/reference_previews.js
"dot" Reporter:
.......
Spec Files: 2 passed, 2 total (100% completed) in 00:00:19
Execution of 2 spec files started at 2022-07-07T14:10:28.282Z
[0-0] RUNNING in chrome - /tests/selenium/specs/page_previews.js
[0-0] PASSED in chrome - /tests/selenium/specs/page_previews.js
[0-1] RUNNING in chrome - /tests/selenium/specs/reference_previews.js
[0-1] PASSED in chrome - /tests/selenium/specs/reference_previews.js
"dot" Reporter:
.......
Spec Files: 2 passed, 2 total (100% completed) in 00:00:17
Execution of 2 spec files started at 2022-07-07T14:10:47.318Z
[0-0] RUNNING in chrome - /tests/selenium/specs/page_previews.js
[0-0] PASSED in chrome - /tests/selenium/specs/page_previews.js
[0-1] RUNNING in chrome - /tests/selenium/specs/reference_previews.js
[0-1] PASSED in chrome - /tests/selenium/specs/reference_previews.js
"dot" Reporter:
.......
Spec Files: 2 passed, 2 total (100% completed) in 00:00:17
Execution of 2 spec files started at 2022-07-07T14:11:06.384Z
[0-0] RUNNING in chrome - /tests/selenium/specs/page_previews.js
[0-0] PASSED in chrome - /tests/selenium/specs/page_previews.js
[0-1] RUNNING in chrome - /tests/selenium/specs/reference_previews.js
[0-1] PASSED in chrome - /tests/selenium/specs/reference_previews.js
"dot" Reporter:
.......
Spec Files: 2 passed, 2 total (100% completed) in 00:00:17
Execution of 2 spec files started at 2022-07-07T14:11:25.200Z
[0-0] RUNNING in chrome - /tests/selenium/specs/page_previews.js
[0-0] AssertionError in "Dwelling on a valid page link Quickly hovering, abandoning and re-hovering a link shows page preview"
AssertionError [ERR_ASSERTION]: Page preview is shown.
at Context.<anonymous> (/home/z/Documents/gerrit/mediawiki/core/extensions/Popups/tests/selenium/specs/page_previews.js:31:3)
[0-0] FAILED in chrome - /tests/selenium/specs/page_previews.js
[0-1] RUNNING in chrome - /tests/selenium/specs/reference_previews.js
[0-1] PASSED in chrome - /tests/selenium/specs/reference_previews.js
"dot" Reporter:
..F....
Spec Files: 1 passed, 1 failed, 2 total (100% completed) in 00:00:19
Execution of 2 spec files started at 2022-07-07T14:11:47.282Z
[0-0] RUNNING in chrome - /tests/selenium/specs/page_previews.js
[0-0] PASSED in chrome - /tests/selenium/specs/page_previews.js
[0-1] RUNNING in chrome - /tests/selenium/specs/reference_previews.js
[0-1] PASSED in chrome - /tests/selenium/specs/reference_previews.js
"dot" Reporter:
.......
Spec Files: 2 passed, 2 total (100% completed) in 00:00:17
Execution of 2 spec files started at 2022-07-07T14:12:06.166Z
[0-0] RUNNING in chrome - /tests/selenium/specs/page_previews.js
[0-0] PASSED in chrome - /tests/selenium/specs/page_previews.js
[0-1] RUNNING in chrome - /tests/selenium/specs/reference_previews.js
[0-1] PASSED in chrome - /tests/selenium/specs/reference_previews.js
"dot" Reporter:
.......
Spec Files: 2 passed, 2 total (100% completed) in 00:00:16
Execution of 2 spec files started at 2022-07-07T14:12:24.006Z
[0-0] RUNNING in chrome - /tests/selenium/specs/page_previews.js
[0-0] AssertionError in "Dwelling on a valid page link I should see a page preview"
AssertionError [ERR_ASSERTION]: Page preview is shown.
at Context.<anonymous> (/home/z/Documents/gerrit/mediawiki/core/extensions/Popups/tests/selenium/specs/page_previews.js:18:3)
[0-0] FAILED in chrome - /tests/selenium/specs/page_previews.js
[0-1] RUNNING in chrome - /tests/selenium/specs/reference_previews.js
[0-1] PASSED in chrome - /tests/selenium/specs/reference_previews.js
"dot" Reporter:
F......
Spec Files: 1 passed, 1 failed, 2 total (100% completed) in 00:00:16
Execution of 2 spec files started at 2022-07-07T14:12:42.290Z
[0-0] RUNNING in chrome - /tests/selenium/specs/page_previews.js
[0-0] PASSED in chrome - /tests/selenium/specs/page_previews.js
[0-1] RUNNING in chrome - /tests/selenium/specs/reference_previews.js
[0-1] PASSED in chrome - /tests/selenium/specs/reference_previews.js
"dot" Reporter:
.......
Spec Files: 2 passed, 2 total (100% completed) in 00:00:16