Page MenuHomePhabricator
Paste P30966

Popups
ArchivedPublic

Authored by zeljkofilipin on Jul 8 2022, 8:20 AM.
Tags
None
Referenced Files
F35311676: Popups
Jul 8 2022, 8:20 AM
Subscribers
None
> selenium-test
> for i in $(seq 1 100); do wdio ./tests/selenium/wdio.conf.js; done
Execution of 2 spec files started at 2022-07-08T07:49:53.280Z
[0-0] RUNNING in chrome - /tests/selenium/specs/page_previews.js
[0-0] PASSED in chrome - /tests/selenium/specs/page_previews.js
[0-1] RUNNING in chrome - /tests/selenium/specs/reference_previews.js
[0-1] PASSED in chrome - /tests/selenium/specs/reference_previews.js
"dot" Reporter:
.......
Spec Files: 2 passed, 2 total (100% completed) in 00:00:16
Execution of 2 spec files started at 2022-07-08T07:50:10.985Z
[0-0] RUNNING in chrome - /tests/selenium/specs/page_previews.js
[0-0] PASSED in chrome - /tests/selenium/specs/page_previews.js
[0-1] RUNNING in chrome - /tests/selenium/specs/reference_previews.js
[0-1] PASSED in chrome - /tests/selenium/specs/reference_previews.js
"dot" Reporter:
.......
Spec Files: 2 passed, 2 total (100% completed) in 00:00:16
Execution of 2 spec files started at 2022-07-08T07:50:28.664Z
[0-0] RUNNING in chrome - /tests/selenium/specs/page_previews.js
[0-0] PASSED in chrome - /tests/selenium/specs/page_previews.js
[0-1] RUNNING in chrome - /tests/selenium/specs/reference_previews.js
[0-1] PASSED in chrome - /tests/selenium/specs/reference_previews.js
"dot" Reporter:
.......
Spec Files: 2 passed, 2 total (100% completed) in 00:00:16
Execution of 2 spec files started at 2022-07-08T07:50:46.397Z
[0-0] RUNNING in chrome - /tests/selenium/specs/page_previews.js
[0-0] PASSED in chrome - /tests/selenium/specs/page_previews.js
[0-1] RUNNING in chrome - /tests/selenium/specs/reference_previews.js
[0-1] PASSED in chrome - /tests/selenium/specs/reference_previews.js
"dot" Reporter:
.......
Spec Files: 2 passed, 2 total (100% completed) in 00:00:16
Execution of 2 spec files started at 2022-07-08T07:51:04.224Z
[0-0] RUNNING in chrome - /tests/selenium/specs/page_previews.js
[0-0] AssertionError in "Dwelling on a valid page link Quickly hovering, abandoning and re-hovering a link shows page preview"
AssertionError [ERR_ASSERTION]: Page preview is shown.
at Context.<anonymous> (/home/z/Documents/gerrit/mediawiki/core/extensions/Popups/tests/selenium/specs/page_previews.js:31:3)
[0-0] FAILED in chrome - /tests/selenium/specs/page_previews.js
[0-1] RUNNING in chrome - /tests/selenium/specs/reference_previews.js
[0-1] PASSED in chrome - /tests/selenium/specs/reference_previews.js
"dot" Reporter:
..F....
Spec Files: 1 passed, 1 failed, 2 total (100% completed) in 00:00:16
Execution of 2 spec files started at 2022-07-08T07:51:22.306Z
[0-0] RUNNING in chrome - /tests/selenium/specs/page_previews.js
[0-0] PASSED in chrome - /tests/selenium/specs/page_previews.js
[0-1] RUNNING in chrome - /tests/selenium/specs/reference_previews.js
[0-1] PASSED in chrome - /tests/selenium/specs/reference_previews.js
"dot" Reporter:
.......
Spec Files: 2 passed, 2 total (100% completed) in 00:00:16
Execution of 2 spec files started at 2022-07-08T07:51:40.117Z
[0-0] RUNNING in chrome - /tests/selenium/specs/page_previews.js
[0-0] PASSED in chrome - /tests/selenium/specs/page_previews.js
[0-1] RUNNING in chrome - /tests/selenium/specs/reference_previews.js
[0-1] PASSED in chrome - /tests/selenium/specs/reference_previews.js
"dot" Reporter:
.......
Spec Files: 2 passed, 2 total (100% completed) in 00:00:16
Execution of 2 spec files started at 2022-07-08T07:51:57.958Z
[0-0] RUNNING in chrome - /tests/selenium/specs/page_previews.js
[0-0] PASSED in chrome - /tests/selenium/specs/page_previews.js
[0-1] RUNNING in chrome - /tests/selenium/specs/reference_previews.js
[0-1] PASSED in chrome - /tests/selenium/specs/reference_previews.js
"dot" Reporter:
.......
Spec Files: 2 passed, 2 total (100% completed) in 00:00:16
Execution of 2 spec files started at 2022-07-08T07:52:15.511Z
[0-0] RUNNING in chrome - /tests/selenium/specs/page_previews.js
[0-0] PASSED in chrome - /tests/selenium/specs/page_previews.js
[0-1] RUNNING in chrome - /tests/selenium/specs/reference_previews.js
[0-1] PASSED in chrome - /tests/selenium/specs/reference_previews.js
"dot" Reporter:
.......
Spec Files: 2 passed, 2 total (100% completed) in 00:00:17
Execution of 2 spec files started at 2022-07-08T07:52:33.981Z
[0-0] RUNNING in chrome - /tests/selenium/specs/page_previews.js
[0-0] PASSED in chrome - /tests/selenium/specs/page_previews.js
[0-1] RUNNING in chrome - /tests/selenium/specs/reference_previews.js
[0-1] PASSED in chrome - /tests/selenium/specs/reference_previews.js
"dot" Reporter:
.......
Spec Files: 2 passed, 2 total (100% completed) in 00:00:16
Execution of 2 spec files started at 2022-07-08T07:52:52.186Z
[0-0] RUNNING in chrome - /tests/selenium/specs/page_previews.js
[0-0] PASSED in chrome - /tests/selenium/specs/page_previews.js
[0-1] RUNNING in chrome - /tests/selenium/specs/reference_previews.js
[0-1] PASSED in chrome - /tests/selenium/specs/reference_previews.js
"dot" Reporter:
.......
Spec Files: 2 passed, 2 total (100% completed) in 00:00:16
Execution of 2 spec files started at 2022-07-08T07:53:09.925Z
[0-0] RUNNING in chrome - /tests/selenium/specs/page_previews.js
[0-0] PASSED in chrome - /tests/selenium/specs/page_previews.js
[0-1] RUNNING in chrome - /tests/selenium/specs/reference_previews.js
[0-1] PASSED in chrome - /tests/selenium/specs/reference_previews.js
"dot" Reporter:
.......
Spec Files: 2 passed, 2 total (100% completed) in 00:00:16
Execution of 2 spec files started at 2022-07-08T07:53:27.547Z
[0-0] RUNNING in chrome - /tests/selenium/specs/page_previews.js
[0-0] PASSED in chrome - /tests/selenium/specs/page_previews.js
[0-1] RUNNING in chrome - /tests/selenium/specs/reference_previews.js
[0-1] PASSED in chrome - /tests/selenium/specs/reference_previews.js
"dot" Reporter:
.......
Spec Files: 2 passed, 2 total (100% completed) in 00:00:16
Execution of 2 spec files started at 2022-07-08T07:53:45.352Z
[0-0] RUNNING in chrome - /tests/selenium/specs/page_previews.js
[0-0] PASSED in chrome - /tests/selenium/specs/page_previews.js
[0-1] RUNNING in chrome - /tests/selenium/specs/reference_previews.js
[0-1] PASSED in chrome - /tests/selenium/specs/reference_previews.js
"dot" Reporter:
.......
Spec Files: 2 passed, 2 total (100% completed) in 00:00:16
Execution of 2 spec files started at 2022-07-08T07:54:03.209Z
[0-0] RUNNING in chrome - /tests/selenium/specs/page_previews.js
[0-0] PASSED in chrome - /tests/selenium/specs/page_previews.js
[0-1] RUNNING in chrome - /tests/selenium/specs/reference_previews.js
[0-1] PASSED in chrome - /tests/selenium/specs/reference_previews.js
"dot" Reporter:
.......
Spec Files: 2 passed, 2 total (100% completed) in 00:00:16
Execution of 2 spec files started at 2022-07-08T07:54:21.301Z
[0-0] RUNNING in chrome - /tests/selenium/specs/page_previews.js
[0-0] PASSED in chrome - /tests/selenium/specs/page_previews.js
[0-1] RUNNING in chrome - /tests/selenium/specs/reference_previews.js
[0-1] PASSED in chrome - /tests/selenium/specs/reference_previews.js
"dot" Reporter:
.......
Spec Files: 2 passed, 2 total (100% completed) in 00:00:16
Execution of 2 spec files started at 2022-07-08T07:54:39.416Z
[0-0] RUNNING in chrome - /tests/selenium/specs/page_previews.js
[0-0] PASSED in chrome - /tests/selenium/specs/page_previews.js
[0-1] RUNNING in chrome - /tests/selenium/specs/reference_previews.js
[0-1] PASSED in chrome - /tests/selenium/specs/reference_previews.js
"dot" Reporter:
.......
Spec Files: 2 passed, 2 total (100% completed) in 00:00:16
Execution of 2 spec files started at 2022-07-08T07:54:57.357Z
[0-0] RUNNING in chrome - /tests/selenium/specs/page_previews.js
[0-0] PASSED in chrome - /tests/selenium/specs/page_previews.js
[0-1] RUNNING in chrome - /tests/selenium/specs/reference_previews.js
[0-1] PASSED in chrome - /tests/selenium/specs/reference_previews.js
"dot" Reporter:
.......
Spec Files: 2 passed, 2 total (100% completed) in 00:00:16
Execution of 2 spec files started at 2022-07-08T07:55:15.692Z
[0-0] RUNNING in chrome - /tests/selenium/specs/page_previews.js
[0-0] AssertionError in "Dwelling on a valid page link Quickly hovering, abandoning and re-hovering a link shows page preview"
AssertionError [ERR_ASSERTION]: Page preview is shown.
at Context.<anonymous> (/home/z/Documents/gerrit/mediawiki/core/extensions/Popups/tests/selenium/specs/page_previews.js:31:3)
[0-0] FAILED in chrome - /tests/selenium/specs/page_previews.js
[0-1] RUNNING in chrome - /tests/selenium/specs/reference_previews.js
[0-1] PASSED in chrome - /tests/selenium/specs/reference_previews.js
"dot" Reporter:
..F....
Spec Files: 1 passed, 1 failed, 2 total (100% completed) in 00:00:16
Execution of 2 spec files started at 2022-07-08T07:55:33.643Z
[0-0] RUNNING in chrome - /tests/selenium/specs/page_previews.js
[0-0] PASSED in chrome - /tests/selenium/specs/page_previews.js
[0-1] RUNNING in chrome - /tests/selenium/specs/reference_previews.js
[0-1] PASSED in chrome - /tests/selenium/specs/reference_previews.js
"dot" Reporter:
.......
Spec Files: 2 passed, 2 total (100% completed) in 00:00:16
Execution of 2 spec files started at 2022-07-08T07:55:51.279Z
[0-0] RUNNING in chrome - /tests/selenium/specs/page_previews.js
[0-0] PASSED in chrome - /tests/selenium/specs/page_previews.js
[0-1] RUNNING in chrome - /tests/selenium/specs/reference_previews.js
[0-1] PASSED in chrome - /tests/selenium/specs/reference_previews.js
"dot" Reporter:
.......
Spec Files: 2 passed, 2 total (100% completed) in 00:00:16
Execution of 2 spec files started at 2022-07-08T07:56:09.190Z
[0-0] RUNNING in chrome - /tests/selenium/specs/page_previews.js
[0-0] PASSED in chrome - /tests/selenium/specs/page_previews.js
[0-1] RUNNING in chrome - /tests/selenium/specs/reference_previews.js
[0-1] PASSED in chrome - /tests/selenium/specs/reference_previews.js
"dot" Reporter:
.......
Spec Files: 2 passed, 2 total (100% completed) in 00:00:16
Execution of 2 spec files started at 2022-07-08T07:56:27.089Z
[0-0] RUNNING in chrome - /tests/selenium/specs/page_previews.js
[0-0] PASSED in chrome - /tests/selenium/specs/page_previews.js
[0-1] RUNNING in chrome - /tests/selenium/specs/reference_previews.js
[0-1] PASSED in chrome - /tests/selenium/specs/reference_previews.js
"dot" Reporter:
.......
Spec Files: 2 passed, 2 total (100% completed) in 00:00:16
Execution of 2 spec files started at 2022-07-08T07:56:44.927Z
[0-0] RUNNING in chrome - /tests/selenium/specs/page_previews.js
[0-0] PASSED in chrome - /tests/selenium/specs/page_previews.js
[0-1] RUNNING in chrome - /tests/selenium/specs/reference_previews.js
[0-1] PASSED in chrome - /tests/selenium/specs/reference_previews.js
"dot" Reporter:
.......
Spec Files: 2 passed, 2 total (100% completed) in 00:00:16
Execution of 2 spec files started at 2022-07-08T07:57:03.058Z
[0-0] RUNNING in chrome - /tests/selenium/specs/page_previews.js
[0-0] PASSED in chrome - /tests/selenium/specs/page_previews.js
[0-1] RUNNING in chrome - /tests/selenium/specs/reference_previews.js
[0-1] PASSED in chrome - /tests/selenium/specs/reference_previews.js
"dot" Reporter:
.......
Spec Files: 2 passed, 2 total (100% completed) in 00:00:16
Execution of 2 spec files started at 2022-07-08T07:57:20.913Z
[0-0] RUNNING in chrome - /tests/selenium/specs/page_previews.js
[0-0] AssertionError in "Dwelling on a valid page link Quickly hovering, abandoning and re-hovering a link shows page preview"
AssertionError [ERR_ASSERTION]: Page preview is shown.
at Context.<anonymous> (/home/z/Documents/gerrit/mediawiki/core/extensions/Popups/tests/selenium/specs/page_previews.js:31:3)
[0-0] FAILED in chrome - /tests/selenium/specs/page_previews.js
[0-1] RUNNING in chrome - /tests/selenium/specs/reference_previews.js
[0-1] PASSED in chrome - /tests/selenium/specs/reference_previews.js
"dot" Reporter:
..F....
Spec Files: 1 passed, 1 failed, 2 total (100% completed) in 00:00:16
Execution of 2 spec files started at 2022-07-08T07:57:38.773Z
[0-0] RUNNING in chrome - /tests/selenium/specs/page_previews.js
[0-0] PASSED in chrome - /tests/selenium/specs/page_previews.js
[0-1] RUNNING in chrome - /tests/selenium/specs/reference_previews.js
[0-1] PASSED in chrome - /tests/selenium/specs/reference_previews.js
"dot" Reporter:
.......
Spec Files: 2 passed, 2 total (100% completed) in 00:00:16
Execution of 2 spec files started at 2022-07-08T07:57:56.222Z
[0-0] RUNNING in chrome - /tests/selenium/specs/page_previews.js
[0-0] PASSED in chrome - /tests/selenium/specs/page_previews.js
[0-1] RUNNING in chrome - /tests/selenium/specs/reference_previews.js
[0-1] PASSED in chrome - /tests/selenium/specs/reference_previews.js
"dot" Reporter:
.......
Spec Files: 2 passed, 2 total (100% completed) in 00:00:16
Execution of 2 spec files started at 2022-07-08T07:58:13.878Z
[0-0] RUNNING in chrome - /tests/selenium/specs/page_previews.js
[0-0] PASSED in chrome - /tests/selenium/specs/page_previews.js
[0-1] RUNNING in chrome - /tests/selenium/specs/reference_previews.js
[0-1] PASSED in chrome - /tests/selenium/specs/reference_previews.js
"dot" Reporter:
.......
Spec Files: 2 passed, 2 total (100% completed) in 00:00:16
Execution of 2 spec files started at 2022-07-08T07:58:31.863Z
[0-0] RUNNING in chrome - /tests/selenium/specs/page_previews.js
[0-0] AssertionError in "Dwelling on a valid page link Quickly hovering, abandoning and re-hovering a link shows page preview"
AssertionError [ERR_ASSERTION]: Page preview is shown.
at Context.<anonymous> (/home/z/Documents/gerrit/mediawiki/core/extensions/Popups/tests/selenium/specs/page_previews.js:31:3)
[0-0] FAILED in chrome - /tests/selenium/specs/page_previews.js
[0-1] RUNNING in chrome - /tests/selenium/specs/reference_previews.js
[0-1] PASSED in chrome - /tests/selenium/specs/reference_previews.js
"dot" Reporter:
..F....
Spec Files: 1 passed, 1 failed, 2 total (100% completed) in 00:00:16
Execution of 2 spec files started at 2022-07-08T07:58:49.718Z
[0-0] RUNNING in chrome - /tests/selenium/specs/page_previews.js
[0-0] PASSED in chrome - /tests/selenium/specs/page_previews.js
[0-1] RUNNING in chrome - /tests/selenium/specs/reference_previews.js
[0-1] PASSED in chrome - /tests/selenium/specs/reference_previews.js
"dot" Reporter:
.......
Spec Files: 2 passed, 2 total (100% completed) in 00:00:16
Execution of 2 spec files started at 2022-07-08T07:59:07.607Z
[0-0] RUNNING in chrome - /tests/selenium/specs/page_previews.js
[0-0] PASSED in chrome - /tests/selenium/specs/page_previews.js
[0-1] RUNNING in chrome - /tests/selenium/specs/reference_previews.js
[0-1] PASSED in chrome - /tests/selenium/specs/reference_previews.js
"dot" Reporter:
.......
Spec Files: 2 passed, 2 total (100% completed) in 00:00:16
Execution of 2 spec files started at 2022-07-08T07:59:25.303Z
[0-0] RUNNING in chrome - /tests/selenium/specs/page_previews.js
[0-0] PASSED in chrome - /tests/selenium/specs/page_previews.js
[0-1] RUNNING in chrome - /tests/selenium/specs/reference_previews.js
[0-1] PASSED in chrome - /tests/selenium/specs/reference_previews.js
"dot" Reporter:
.......
Spec Files: 2 passed, 2 total (100% completed) in 00:00:16
Execution of 2 spec files started at 2022-07-08T07:59:43.195Z
[0-0] RUNNING in chrome - /tests/selenium/specs/page_previews.js
[0-0] AssertionError in "Dwelling on a valid page link Quickly hovering, abandoning and re-hovering a link shows page preview"
AssertionError [ERR_ASSERTION]: Page preview is shown.
at Context.<anonymous> (/home/z/Documents/gerrit/mediawiki/core/extensions/Popups/tests/selenium/specs/page_previews.js:31:3)
[0-0] FAILED in chrome - /tests/selenium/specs/page_previews.js
[0-1] RUNNING in chrome - /tests/selenium/specs/reference_previews.js
[0-1] PASSED in chrome - /tests/selenium/specs/reference_previews.js
"dot" Reporter:
..F....
Spec Files: 1 passed, 1 failed, 2 total (100% completed) in 00:00:16
Execution of 2 spec files started at 2022-07-08T08:00:01.001Z
[0-0] RUNNING in chrome - /tests/selenium/specs/page_previews.js
[0-0] PASSED in chrome - /tests/selenium/specs/page_previews.js
[0-1] RUNNING in chrome - /tests/selenium/specs/reference_previews.js
[0-1] PASSED in chrome - /tests/selenium/specs/reference_previews.js
"dot" Reporter:
.......
Spec Files: 2 passed, 2 total (100% completed) in 00:00:16
Execution of 2 spec files started at 2022-07-08T08:00:18.564Z
[0-0] RUNNING in chrome - /tests/selenium/specs/page_previews.js
[0-0] PASSED in chrome - /tests/selenium/specs/page_previews.js
[0-1] RUNNING in chrome - /tests/selenium/specs/reference_previews.js
[0-1] PASSED in chrome - /tests/selenium/specs/reference_previews.js
"dot" Reporter:
.......
Spec Files: 2 passed, 2 total (100% completed) in 00:00:16
Execution of 2 spec files started at 2022-07-08T08:00:36.295Z
[0-0] RUNNING in chrome - /tests/selenium/specs/page_previews.js
[0-0] PASSED in chrome - /tests/selenium/specs/page_previews.js
[0-1] RUNNING in chrome - /tests/selenium/specs/reference_previews.js
[0-1] PASSED in chrome - /tests/selenium/specs/reference_previews.js
"dot" Reporter:
.......
Spec Files: 2 passed, 2 total (100% completed) in 00:00:16
Execution of 2 spec files started at 2022-07-08T08:00:54.489Z
[0-0] RUNNING in chrome - /tests/selenium/specs/page_previews.js
[0-0] PASSED in chrome - /tests/selenium/specs/page_previews.js
[0-1] RUNNING in chrome - /tests/selenium/specs/reference_previews.js
[0-1] PASSED in chrome - /tests/selenium/specs/reference_previews.js
"dot" Reporter:
.......
Spec Files: 2 passed, 2 total (100% completed) in 00:00:16
Execution of 2 spec files started at 2022-07-08T08:01:12.374Z
[0-0] RUNNING in chrome - /tests/selenium/specs/page_previews.js
[0-0] PASSED in chrome - /tests/selenium/specs/page_previews.js
[0-1] RUNNING in chrome - /tests/selenium/specs/reference_previews.js
[0-1] PASSED in chrome - /tests/selenium/specs/reference_previews.js
"dot" Reporter:
.......
Spec Files: 2 passed, 2 total (100% completed) in 00:00:16
Execution of 2 spec files started at 2022-07-08T08:01:29.788Z
[0-0] RUNNING in chrome - /tests/selenium/specs/page_previews.js
[0-0] PASSED in chrome - /tests/selenium/specs/page_previews.js
[0-1] RUNNING in chrome - /tests/selenium/specs/reference_previews.js
[0-1] PASSED in chrome - /tests/selenium/specs/reference_previews.js
"dot" Reporter:
.......
Spec Files: 2 passed, 2 total (100% completed) in 00:00:16
Execution of 2 spec files started at 2022-07-08T08:01:47.735Z
[0-0] RUNNING in chrome - /tests/selenium/specs/page_previews.js
[0-0] PASSED in chrome - /tests/selenium/specs/page_previews.js
[0-1] RUNNING in chrome - /tests/selenium/specs/reference_previews.js
[0-1] PASSED in chrome - /tests/selenium/specs/reference_previews.js
"dot" Reporter:
.......
Spec Files: 2 passed, 2 total (100% completed) in 00:00:16
Execution of 2 spec files started at 2022-07-08T08:02:05.842Z
[0-0] RUNNING in chrome - /tests/selenium/specs/page_previews.js
[0-0] PASSED in chrome - /tests/selenium/specs/page_previews.js
[0-1] RUNNING in chrome - /tests/selenium/specs/reference_previews.js
[0-1] PASSED in chrome - /tests/selenium/specs/reference_previews.js
"dot" Reporter:
.......
Spec Files: 2 passed, 2 total (100% completed) in 00:00:16
Execution of 2 spec files started at 2022-07-08T08:02:23.914Z
[0-0] RUNNING in chrome - /tests/selenium/specs/page_previews.js
[0-0] PASSED in chrome - /tests/selenium/specs/page_previews.js
[0-1] RUNNING in chrome - /tests/selenium/specs/reference_previews.js
[0-1] PASSED in chrome - /tests/selenium/specs/reference_previews.js
"dot" Reporter:
.......
Spec Files: 2 passed, 2 total (100% completed) in 00:00:16
Execution of 2 spec files started at 2022-07-08T08:02:41.951Z
[0-0] RUNNING in chrome - /tests/selenium/specs/page_previews.js
[0-0] PASSED in chrome - /tests/selenium/specs/page_previews.js
[0-1] RUNNING in chrome - /tests/selenium/specs/reference_previews.js
[0-1] PASSED in chrome - /tests/selenium/specs/reference_previews.js
"dot" Reporter:
.......
Spec Files: 2 passed, 2 total (100% completed) in 00:00:16
Execution of 2 spec files started at 2022-07-08T08:03:00.230Z
[0-0] RUNNING in chrome - /tests/selenium/specs/page_previews.js
[0-0] PASSED in chrome - /tests/selenium/specs/page_previews.js
[0-1] RUNNING in chrome - /tests/selenium/specs/reference_previews.js
[0-1] PASSED in chrome - /tests/selenium/specs/reference_previews.js
"dot" Reporter:
.......
Spec Files: 2 passed, 2 total (100% completed) in 00:00:16
Execution of 2 spec files started at 2022-07-08T08:03:18.300Z
[0-0] RUNNING in chrome - /tests/selenium/specs/page_previews.js
[0-0] PASSED in chrome - /tests/selenium/specs/page_previews.js
[0-1] RUNNING in chrome - /tests/selenium/specs/reference_previews.js
[0-1] PASSED in chrome - /tests/selenium/specs/reference_previews.js
"dot" Reporter:
.......
Spec Files: 2 passed, 2 total (100% completed) in 00:00:16
Execution of 2 spec files started at 2022-07-08T08:03:36.518Z
[0-0] RUNNING in chrome - /tests/selenium/specs/page_previews.js
[0-0] PASSED in chrome - /tests/selenium/specs/page_previews.js
[0-1] RUNNING in chrome - /tests/selenium/specs/reference_previews.js
[0-1] PASSED in chrome - /tests/selenium/specs/reference_previews.js
"dot" Reporter:
.......
Spec Files: 2 passed, 2 total (100% completed) in 00:00:16
Execution of 2 spec files started at 2022-07-08T08:03:54.720Z
[0-0] RUNNING in chrome - /tests/selenium/specs/page_previews.js
[0-0] PASSED in chrome - /tests/selenium/specs/page_previews.js
[0-1] RUNNING in chrome - /tests/selenium/specs/reference_previews.js
[0-1] PASSED in chrome - /tests/selenium/specs/reference_previews.js
"dot" Reporter:
.......
Spec Files: 2 passed, 2 total (100% completed) in 00:00:16
Execution of 2 spec files started at 2022-07-08T08:04:12.855Z
[0-0] RUNNING in chrome - /tests/selenium/specs/page_previews.js
[0-0] PASSED in chrome - /tests/selenium/specs/page_previews.js
[0-1] RUNNING in chrome - /tests/selenium/specs/reference_previews.js
[0-1] PASSED in chrome - /tests/selenium/specs/reference_previews.js
"dot" Reporter:
.......
Spec Files: 2 passed, 2 total (100% completed) in 00:00:16
Execution of 2 spec files started at 2022-07-08T08:04:30.966Z
[0-0] RUNNING in chrome - /tests/selenium/specs/page_previews.js
[0-0] PASSED in chrome - /tests/selenium/specs/page_previews.js
[0-1] RUNNING in chrome - /tests/selenium/specs/reference_previews.js
[0-1] PASSED in chrome - /tests/selenium/specs/reference_previews.js
"dot" Reporter:
.......
Spec Files: 2 passed, 2 total (100% completed) in 00:00:16
Execution of 2 spec files started at 2022-07-08T08:04:49.207Z
[0-0] RUNNING in chrome - /tests/selenium/specs/page_previews.js
[0-0] PASSED in chrome - /tests/selenium/specs/page_previews.js
[0-1] RUNNING in chrome - /tests/selenium/specs/reference_previews.js
[0-1] PASSED in chrome - /tests/selenium/specs/reference_previews.js
"dot" Reporter:
.......
Spec Files: 2 passed, 2 total (100% completed) in 00:00:16
Execution of 2 spec files started at 2022-07-08T08:05:07.249Z
[0-0] RUNNING in chrome - /tests/selenium/specs/page_previews.js
[0-0] PASSED in chrome - /tests/selenium/specs/page_previews.js
[0-1] RUNNING in chrome - /tests/selenium/specs/reference_previews.js
[0-1] PASSED in chrome - /tests/selenium/specs/reference_previews.js
"dot" Reporter:
.......
Spec Files: 2 passed, 2 total (100% completed) in 00:00:16
Execution of 2 spec files started at 2022-07-08T08:05:25.264Z
[0-0] RUNNING in chrome - /tests/selenium/specs/page_previews.js
[0-0] PASSED in chrome - /tests/selenium/specs/page_previews.js
[0-1] RUNNING in chrome - /tests/selenium/specs/reference_previews.js
[0-1] PASSED in chrome - /tests/selenium/specs/reference_previews.js
"dot" Reporter:
.......
Spec Files: 2 passed, 2 total (100% completed) in 00:00:16
Execution of 2 spec files started at 2022-07-08T08:05:43.385Z
[0-0] RUNNING in chrome - /tests/selenium/specs/page_previews.js
[0-0] PASSED in chrome - /tests/selenium/specs/page_previews.js
[0-1] RUNNING in chrome - /tests/selenium/specs/reference_previews.js
[0-1] PASSED in chrome - /tests/selenium/specs/reference_previews.js
"dot" Reporter:
.......
Spec Files: 2 passed, 2 total (100% completed) in 00:00:16
Execution of 2 spec files started at 2022-07-08T08:06:01.546Z
[0-0] RUNNING in chrome - /tests/selenium/specs/page_previews.js
[0-0] PASSED in chrome - /tests/selenium/specs/page_previews.js
[0-1] RUNNING in chrome - /tests/selenium/specs/reference_previews.js
[0-1] PASSED in chrome - /tests/selenium/specs/reference_previews.js
"dot" Reporter:
.......
Spec Files: 2 passed, 2 total (100% completed) in 00:00:16
Execution of 2 spec files started at 2022-07-08T08:06:19.486Z
[0-0] RUNNING in chrome - /tests/selenium/specs/page_previews.js
[0-0] PASSED in chrome - /tests/selenium/specs/page_previews.js
[0-1] RUNNING in chrome - /tests/selenium/specs/reference_previews.js
[0-1] PASSED in chrome - /tests/selenium/specs/reference_previews.js
"dot" Reporter:
.......
Spec Files: 2 passed, 2 total (100% completed) in 00:00:16
Execution of 2 spec files started at 2022-07-08T08:06:37.698Z
[0-0] RUNNING in chrome - /tests/selenium/specs/page_previews.js
[0-0] PASSED in chrome - /tests/selenium/specs/page_previews.js
[0-1] RUNNING in chrome - /tests/selenium/specs/reference_previews.js
[0-1] PASSED in chrome - /tests/selenium/specs/reference_previews.js
"dot" Reporter:
.......
Spec Files: 2 passed, 2 total (100% completed) in 00:00:16
Execution of 2 spec files started at 2022-07-08T08:06:55.315Z
[0-0] RUNNING in chrome - /tests/selenium/specs/page_previews.js
[0-0] PASSED in chrome - /tests/selenium/specs/page_previews.js
[0-1] RUNNING in chrome - /tests/selenium/specs/reference_previews.js
[0-1] PASSED in chrome - /tests/selenium/specs/reference_previews.js
"dot" Reporter:
.......
Spec Files: 2 passed, 2 total (100% completed) in 00:00:16
Execution of 2 spec files started at 2022-07-08T08:07:13.470Z
[0-0] RUNNING in chrome - /tests/selenium/specs/page_previews.js
[0-0] PASSED in chrome - /tests/selenium/specs/page_previews.js
[0-1] RUNNING in chrome - /tests/selenium/specs/reference_previews.js
[0-1] PASSED in chrome - /tests/selenium/specs/reference_previews.js
"dot" Reporter:
.......
Spec Files: 2 passed, 2 total (100% completed) in 00:00:16
Execution of 2 spec files started at 2022-07-08T08:07:31.727Z
[0-0] RUNNING in chrome - /tests/selenium/specs/page_previews.js
[0-0] PASSED in chrome - /tests/selenium/specs/page_previews.js
[0-1] RUNNING in chrome - /tests/selenium/specs/reference_previews.js
[0-1] PASSED in chrome - /tests/selenium/specs/reference_previews.js
"dot" Reporter:
.......
Spec Files: 2 passed, 2 total (100% completed) in 00:00:16
Execution of 2 spec files started at 2022-07-08T08:07:50.038Z
[0-0] RUNNING in chrome - /tests/selenium/specs/page_previews.js
[0-0] PASSED in chrome - /tests/selenium/specs/page_previews.js
[0-1] RUNNING in chrome - /tests/selenium/specs/reference_previews.js
[0-1] PASSED in chrome - /tests/selenium/specs/reference_previews.js
"dot" Reporter:
.......
Spec Files: 2 passed, 2 total (100% completed) in 00:00:16
Execution of 2 spec files started at 2022-07-08T08:08:08.229Z
[0-0] RUNNING in chrome - /tests/selenium/specs/page_previews.js
[0-0] PASSED in chrome - /tests/selenium/specs/page_previews.js
[0-1] RUNNING in chrome - /tests/selenium/specs/reference_previews.js
[0-1] PASSED in chrome - /tests/selenium/specs/reference_previews.js
"dot" Reporter:
.......
Spec Files: 2 passed, 2 total (100% completed) in 00:00:16
Execution of 2 spec files started at 2022-07-08T08:08:26.076Z
[0-0] RUNNING in chrome - /tests/selenium/specs/page_previews.js
[0-0] PASSED in chrome - /tests/selenium/specs/page_previews.js
[0-1] RUNNING in chrome - /tests/selenium/specs/reference_previews.js
[0-1] PASSED in chrome - /tests/selenium/specs/reference_previews.js
"dot" Reporter:
.......
Spec Files: 2 passed, 2 total (100% completed) in 00:00:16
Execution of 2 spec files started at 2022-07-08T08:08:43.986Z
[0-0] RUNNING in chrome - /tests/selenium/specs/page_previews.js
[0-0] AssertionError in "Dwelling on a valid page link I should see a page preview"
AssertionError [ERR_ASSERTION]: Page preview is shown.
at Context.<anonymous> (/home/z/Documents/gerrit/mediawiki/core/extensions/Popups/tests/selenium/specs/page_previews.js:18:3)
[0-0] FAILED in chrome - /tests/selenium/specs/page_previews.js
[0-1] RUNNING in chrome - /tests/selenium/specs/reference_previews.js
[0-1] PASSED in chrome - /tests/selenium/specs/reference_previews.js
"dot" Reporter:
F......
Spec Files: 1 passed, 1 failed, 2 total (100% completed) in 00:00:16
Execution of 2 spec files started at 2022-07-08T08:09:01.939Z
[0-0] RUNNING in chrome - /tests/selenium/specs/page_previews.js
[0-0] PASSED in chrome - /tests/selenium/specs/page_previews.js
[0-1] RUNNING in chrome - /tests/selenium/specs/reference_previews.js
[0-1] PASSED in chrome - /tests/selenium/specs/reference_previews.js
"dot" Reporter:
.......
Spec Files: 2 passed, 2 total (100% completed) in 00:00:16
Execution of 2 spec files started at 2022-07-08T08:09:19.758Z
[0-0] RUNNING in chrome - /tests/selenium/specs/page_previews.js
[0-0] AssertionError in "Dwelling on a valid page link Quickly hovering, abandoning and re-hovering a link shows page preview"
AssertionError [ERR_ASSERTION]: Page preview is shown.
at Context.<anonymous> (/home/z/Documents/gerrit/mediawiki/core/extensions/Popups/tests/selenium/specs/page_previews.js:31:3)
[0-0] FAILED in chrome - /tests/selenium/specs/page_previews.js
[0-1] RUNNING in chrome - /tests/selenium/specs/reference_previews.js
[0-1] PASSED in chrome - /tests/selenium/specs/reference_previews.js
"dot" Reporter:
..F....
Spec Files: 1 passed, 1 failed, 2 total (100% completed) in 00:00:16
Execution of 2 spec files started at 2022-07-08T08:09:37.728Z
[0-0] RUNNING in chrome - /tests/selenium/specs/page_previews.js
[0-0] PASSED in chrome - /tests/selenium/specs/page_previews.js
[0-1] RUNNING in chrome - /tests/selenium/specs/reference_previews.js
[0-1] PASSED in chrome - /tests/selenium/specs/reference_previews.js
"dot" Reporter:
.......
Spec Files: 2 passed, 2 total (100% completed) in 00:00:16
Execution of 2 spec files started at 2022-07-08T08:09:55.550Z
[0-0] RUNNING in chrome - /tests/selenium/specs/page_previews.js
[0-0] PASSED in chrome - /tests/selenium/specs/page_previews.js
[0-1] RUNNING in chrome - /tests/selenium/specs/reference_previews.js
[0-1] PASSED in chrome - /tests/selenium/specs/reference_previews.js
"dot" Reporter:
.......
Spec Files: 2 passed, 2 total (100% completed) in 00:00:16
Execution of 2 spec files started at 2022-07-08T08:10:13.307Z
[0-0] RUNNING in chrome - /tests/selenium/specs/page_previews.js
[0-0] PASSED in chrome - /tests/selenium/specs/page_previews.js
[0-1] RUNNING in chrome - /tests/selenium/specs/reference_previews.js
[0-1] PASSED in chrome - /tests/selenium/specs/reference_previews.js
"dot" Reporter:
.......
Spec Files: 2 passed, 2 total (100% completed) in 00:00:16
Execution of 2 spec files started at 2022-07-08T08:10:30.895Z
[0-0] RUNNING in chrome - /tests/selenium/specs/page_previews.js
[0-0] PASSED in chrome - /tests/selenium/specs/page_previews.js
[0-1] RUNNING in chrome - /tests/selenium/specs/reference_previews.js
[0-1] PASSED in chrome - /tests/selenium/specs/reference_previews.js
"dot" Reporter:
.......
Spec Files: 2 passed, 2 total (100% completed) in 00:00:16
Execution of 2 spec files started at 2022-07-08T08:10:48.751Z
[0-0] RUNNING in chrome - /tests/selenium/specs/page_previews.js
[0-0] PASSED in chrome - /tests/selenium/specs/page_previews.js
[0-1] RUNNING in chrome - /tests/selenium/specs/reference_previews.js
[0-1] PASSED in chrome - /tests/selenium/specs/reference_previews.js
"dot" Reporter:
.......
Spec Files: 2 passed, 2 total (100% completed) in 00:00:16
Execution of 2 spec files started at 2022-07-08T08:11:06.779Z
[0-0] RUNNING in chrome - /tests/selenium/specs/page_previews.js
[0-0] PASSED in chrome - /tests/selenium/specs/page_previews.js
[0-1] RUNNING in chrome - /tests/selenium/specs/reference_previews.js
[0-1] PASSED in chrome - /tests/selenium/specs/reference_previews.js
"dot" Reporter:
.......
Spec Files: 2 passed, 2 total (100% completed) in 00:00:16
Execution of 2 spec files started at 2022-07-08T08:11:24.660Z
[0-0] RUNNING in chrome - /tests/selenium/specs/page_previews.js
[0-0] PASSED in chrome - /tests/selenium/specs/page_previews.js
[0-1] RUNNING in chrome - /tests/selenium/specs/reference_previews.js
[0-1] PASSED in chrome - /tests/selenium/specs/reference_previews.js
"dot" Reporter:
.......
Spec Files: 2 passed, 2 total (100% completed) in 00:00:16
Execution of 2 spec files started at 2022-07-08T08:11:42.590Z
[0-0] RUNNING in chrome - /tests/selenium/specs/page_previews.js
[0-0] PASSED in chrome - /tests/selenium/specs/page_previews.js
[0-1] RUNNING in chrome - /tests/selenium/specs/reference_previews.js
[0-1] PASSED in chrome - /tests/selenium/specs/reference_previews.js
"dot" Reporter:
.......
Spec Files: 2 passed, 2 total (100% completed) in 00:00:16
Execution of 2 spec files started at 2022-07-08T08:12:00.521Z
[0-0] RUNNING in chrome - /tests/selenium/specs/page_previews.js
[0-0] PASSED in chrome - /tests/selenium/specs/page_previews.js
[0-1] RUNNING in chrome - /tests/selenium/specs/reference_previews.js
[0-1] PASSED in chrome - /tests/selenium/specs/reference_previews.js
"dot" Reporter:
.......
Spec Files: 2 passed, 2 total (100% completed) in 00:00:16
Execution of 2 spec files started at 2022-07-08T08:12:18.456Z
[0-0] RUNNING in chrome - /tests/selenium/specs/page_previews.js
[0-0] PASSED in chrome - /tests/selenium/specs/page_previews.js
[0-1] RUNNING in chrome - /tests/selenium/specs/reference_previews.js
[0-1] PASSED in chrome - /tests/selenium/specs/reference_previews.js
"dot" Reporter:
.......
Spec Files: 2 passed, 2 total (100% completed) in 00:00:16
Execution of 2 spec files started at 2022-07-08T08:12:36.283Z
[0-0] RUNNING in chrome - /tests/selenium/specs/page_previews.js
[0-0] PASSED in chrome - /tests/selenium/specs/page_previews.js
[0-1] RUNNING in chrome - /tests/selenium/specs/reference_previews.js
[0-1] PASSED in chrome - /tests/selenium/specs/reference_previews.js
"dot" Reporter:
.......
Spec Files: 2 passed, 2 total (100% completed) in 00:00:16
Execution of 2 spec files started at 2022-07-08T08:12:54.194Z
[0-0] RUNNING in chrome - /tests/selenium/specs/page_previews.js
[0-0] PASSED in chrome - /tests/selenium/specs/page_previews.js
[0-1] RUNNING in chrome - /tests/selenium/specs/reference_previews.js
[0-1] PASSED in chrome - /tests/selenium/specs/reference_previews.js
"dot" Reporter:
.......
Spec Files: 2 passed, 2 total (100% completed) in 00:00:16
Execution of 2 spec files started at 2022-07-08T08:13:11.948Z
[0-0] RUNNING in chrome - /tests/selenium/specs/page_previews.js
[0-0] PASSED in chrome - /tests/selenium/specs/page_previews.js
[0-1] RUNNING in chrome - /tests/selenium/specs/reference_previews.js
[0-1] PASSED in chrome - /tests/selenium/specs/reference_previews.js
"dot" Reporter:
.......
Spec Files: 2 passed, 2 total (100% completed) in 00:00:16
Execution of 2 spec files started at 2022-07-08T08:13:29.621Z
[0-0] RUNNING in chrome - /tests/selenium/specs/page_previews.js
[0-0] PASSED in chrome - /tests/selenium/specs/page_previews.js
[0-1] RUNNING in chrome - /tests/selenium/specs/reference_previews.js
[0-1] PASSED in chrome - /tests/selenium/specs/reference_previews.js
"dot" Reporter:
.......
Spec Files: 2 passed, 2 total (100% completed) in 00:00:16
Execution of 2 spec files started at 2022-07-08T08:13:47.317Z
[0-0] RUNNING in chrome - /tests/selenium/specs/page_previews.js
[0-0] PASSED in chrome - /tests/selenium/specs/page_previews.js
[0-1] RUNNING in chrome - /tests/selenium/specs/reference_previews.js
[0-1] PASSED in chrome - /tests/selenium/specs/reference_previews.js
"dot" Reporter:
.......
Spec Files: 2 passed, 2 total (100% completed) in 00:00:16
Execution of 2 spec files started at 2022-07-08T08:14:05.342Z
[0-0] RUNNING in chrome - /tests/selenium/specs/page_previews.js
[0-0] PASSED in chrome - /tests/selenium/specs/page_previews.js
[0-1] RUNNING in chrome - /tests/selenium/specs/reference_previews.js
[0-1] PASSED in chrome - /tests/selenium/specs/reference_previews.js
"dot" Reporter:
.......
Spec Files: 2 passed, 2 total (100% completed) in 00:00:16
Execution of 2 spec files started at 2022-07-08T08:14:23.177Z
[0-0] RUNNING in chrome - /tests/selenium/specs/page_previews.js
[0-0] PASSED in chrome - /tests/selenium/specs/page_previews.js
[0-1] RUNNING in chrome - /tests/selenium/specs/reference_previews.js
[0-1] PASSED in chrome - /tests/selenium/specs/reference_previews.js
"dot" Reporter:
.......
Spec Files: 2 passed, 2 total (100% completed) in 00:00:16
Execution of 2 spec files started at 2022-07-08T08:14:41.195Z
[0-0] RUNNING in chrome - /tests/selenium/specs/page_previews.js
[0-0] PASSED in chrome - /tests/selenium/specs/page_previews.js
[0-1] RUNNING in chrome - /tests/selenium/specs/reference_previews.js
[0-1] PASSED in chrome - /tests/selenium/specs/reference_previews.js
"dot" Reporter:
.......
Spec Files: 2 passed, 2 total (100% completed) in 00:00:16
Execution of 2 spec files started at 2022-07-08T08:14:59.114Z
[0-0] RUNNING in chrome - /tests/selenium/specs/page_previews.js
[0-0] PASSED in chrome - /tests/selenium/specs/page_previews.js
[0-1] RUNNING in chrome - /tests/selenium/specs/reference_previews.js
[0-1] PASSED in chrome - /tests/selenium/specs/reference_previews.js
"dot" Reporter:
.......
Spec Files: 2 passed, 2 total (100% completed) in 00:00:16
Execution of 2 spec files started at 2022-07-08T08:15:16.927Z
[0-0] RUNNING in chrome - /tests/selenium/specs/page_previews.js
[0-0] PASSED in chrome - /tests/selenium/specs/page_previews.js
[0-1] RUNNING in chrome - /tests/selenium/specs/reference_previews.js
[0-1] PASSED in chrome - /tests/selenium/specs/reference_previews.js
"dot" Reporter:
.......
Spec Files: 2 passed, 2 total (100% completed) in 00:00:16
Execution of 2 spec files started at 2022-07-08T08:15:34.778Z
[0-0] RUNNING in chrome - /tests/selenium/specs/page_previews.js
[0-0] PASSED in chrome - /tests/selenium/specs/page_previews.js
[0-1] RUNNING in chrome - /tests/selenium/specs/reference_previews.js
[0-1] PASSED in chrome - /tests/selenium/specs/reference_previews.js
"dot" Reporter:
.......
Spec Files: 2 passed, 2 total (100% completed) in 00:00:16
Execution of 2 spec files started at 2022-07-08T08:15:52.528Z
[0-0] RUNNING in chrome - /tests/selenium/specs/page_previews.js
[0-0] PASSED in chrome - /tests/selenium/specs/page_previews.js
[0-1] RUNNING in chrome - /tests/selenium/specs/reference_previews.js
[0-1] PASSED in chrome - /tests/selenium/specs/reference_previews.js
"dot" Reporter:
.......
Spec Files: 2 passed, 2 total (100% completed) in 00:00:16
Execution of 2 spec files started at 2022-07-08T08:16:10.351Z
[0-0] RUNNING in chrome - /tests/selenium/specs/page_previews.js
[0-0] PASSED in chrome - /tests/selenium/specs/page_previews.js
[0-1] RUNNING in chrome - /tests/selenium/specs/reference_previews.js
[0-1] PASSED in chrome - /tests/selenium/specs/reference_previews.js
"dot" Reporter:
.......
Spec Files: 2 passed, 2 total (100% completed) in 00:00:16
Execution of 2 spec files started at 2022-07-08T08:16:28.293Z
[0-0] RUNNING in chrome - /tests/selenium/specs/page_previews.js
[0-0] PASSED in chrome - /tests/selenium/specs/page_previews.js
[0-1] RUNNING in chrome - /tests/selenium/specs/reference_previews.js
[0-1] PASSED in chrome - /tests/selenium/specs/reference_previews.js
"dot" Reporter:
.......
Spec Files: 2 passed, 2 total (100% completed) in 00:00:16
Execution of 2 spec files started at 2022-07-08T08:16:45.987Z
[0-0] RUNNING in chrome - /tests/selenium/specs/page_previews.js
[0-0] PASSED in chrome - /tests/selenium/specs/page_previews.js
[0-1] RUNNING in chrome - /tests/selenium/specs/reference_previews.js
[0-1] PASSED in chrome - /tests/selenium/specs/reference_previews.js
"dot" Reporter:
.......
Spec Files: 2 passed, 2 total (100% completed) in 00:00:16
Execution of 2 spec files started at 2022-07-08T08:17:03.611Z
[0-0] RUNNING in chrome - /tests/selenium/specs/page_previews.js
[0-0] PASSED in chrome - /tests/selenium/specs/page_previews.js
[0-1] RUNNING in chrome - /tests/selenium/specs/reference_previews.js
[0-1] PASSED in chrome - /tests/selenium/specs/reference_previews.js
"dot" Reporter:
.......
Spec Files: 2 passed, 2 total (100% completed) in 00:00:16
Execution of 2 spec files started at 2022-07-08T08:17:21.455Z
[0-0] RUNNING in chrome - /tests/selenium/specs/page_previews.js
[0-0] PASSED in chrome - /tests/selenium/specs/page_previews.js
[0-1] RUNNING in chrome - /tests/selenium/specs/reference_previews.js
[0-1] PASSED in chrome - /tests/selenium/specs/reference_previews.js
"dot" Reporter:
.......
Spec Files: 2 passed, 2 total (100% completed) in 00:00:16
Execution of 2 spec files started at 2022-07-08T08:17:39.481Z
[0-0] RUNNING in chrome - /tests/selenium/specs/page_previews.js
[0-0] PASSED in chrome - /tests/selenium/specs/page_previews.js
[0-1] RUNNING in chrome - /tests/selenium/specs/reference_previews.js
[0-1] PASSED in chrome - /tests/selenium/specs/reference_previews.js
"dot" Reporter:
.......
Spec Files: 2 passed, 2 total (100% completed) in 00:00:16
Execution of 2 spec files started at 2022-07-08T08:17:57.423Z
[0-0] RUNNING in chrome - /tests/selenium/specs/page_previews.js
[0-0] AssertionError in "Dwelling on a valid page link Quickly hovering, abandoning and re-hovering a link shows page preview"
AssertionError [ERR_ASSERTION]: Page preview is shown.
at Context.<anonymous> (/home/z/Documents/gerrit/mediawiki/core/extensions/Popups/tests/selenium/specs/page_previews.js:31:3)
[0-0] FAILED in chrome - /tests/selenium/specs/page_previews.js
[0-1] RUNNING in chrome - /tests/selenium/specs/reference_previews.js
[0-1] PASSED in chrome - /tests/selenium/specs/reference_previews.js
"dot" Reporter:
..F....
Spec Files: 1 passed, 1 failed, 2 total (100% completed) in 00:00:16
Execution of 2 spec files started at 2022-07-08T08:18:15.157Z
[0-0] RUNNING in chrome - /tests/selenium/specs/page_previews.js
[0-0] PASSED in chrome - /tests/selenium/specs/page_previews.js
[0-1] RUNNING in chrome - /tests/selenium/specs/reference_previews.js
[0-1] PASSED in chrome - /tests/selenium/specs/reference_previews.js
"dot" Reporter:
.......
Spec Files: 2 passed, 2 total (100% completed) in 00:00:16
Execution of 2 spec files started at 2022-07-08T08:18:33.020Z
[0-0] RUNNING in chrome - /tests/selenium/specs/page_previews.js
[0-0] PASSED in chrome - /tests/selenium/specs/page_previews.js
[0-1] RUNNING in chrome - /tests/selenium/specs/reference_previews.js
[0-1] PASSED in chrome - /tests/selenium/specs/reference_previews.js
"dot" Reporter:
.......
Spec Files: 2 passed, 2 total (100% completed) in 00:00:16
Execution of 2 spec files started at 2022-07-08T08:18:50.774Z
[0-0] RUNNING in chrome - /tests/selenium/specs/page_previews.js
[0-0] AssertionError in "Dwelling on a valid page link Quickly hovering, abandoning and re-hovering a link shows page preview"
AssertionError [ERR_ASSERTION]: Page preview is shown.
at Context.<anonymous> (/home/z/Documents/gerrit/mediawiki/core/extensions/Popups/tests/selenium/specs/page_previews.js:31:3)
[0-0] FAILED in chrome - /tests/selenium/specs/page_previews.js
[0-1] RUNNING in chrome - /tests/selenium/specs/reference_previews.js
[0-1] PASSED in chrome - /tests/selenium/specs/reference_previews.js
"dot" Reporter:
..F....
Spec Files: 1 passed, 1 failed, 2 total (100% completed) in 00:00:16
Execution of 2 spec files started at 2022-07-08T08:19:08.667Z
[0-0] RUNNING in chrome - /tests/selenium/specs/page_previews.js
[0-0] PASSED in chrome - /tests/selenium/specs/page_previews.js
[0-1] RUNNING in chrome - /tests/selenium/specs/reference_previews.js
[0-1] PASSED in chrome - /tests/selenium/specs/reference_previews.js
"dot" Reporter:
.......
Spec Files: 2 passed, 2 total (100% completed) in 00:00:16
Execution of 2 spec files started at 2022-07-08T08:19:26.460Z
[0-0] RUNNING in chrome - /tests/selenium/specs/page_previews.js
[0-0] PASSED in chrome - /tests/selenium/specs/page_previews.js
[0-1] RUNNING in chrome - /tests/selenium/specs/reference_previews.js
[0-1] PASSED in chrome - /tests/selenium/specs/reference_previews.js
"dot" Reporter:
.......
Spec Files: 2 passed, 2 total (100% completed) in 00:00:16