Page MenuHomePhabricator
Paste P30972

TemplateWizard
ArchivedPublic

Authored by zeljkofilipin on Jul 8 2022, 1:08 PM.
Tags
None
Referenced Files
F35311984: TemplateWizard
Jul 8 2022, 1:08 PM
Subscribers
None
> selenium-test
> for i in $(seq 1 100); do wdio ./tests/selenium/wdio.conf.js; done
Execution of 1 spec files started at 2022-07-08T12:38:59.238Z
[0-0] RUNNING in chrome - /tests/selenium/specs/TemplateWizard.js
[0-0] PASSED in chrome - /tests/selenium/specs/TemplateWizard.js
"dot" Reporter:
...
Spec Files: 1 passed, 1 total (100% completed) in 00:00:11
Execution of 1 spec files started at 2022-07-08T12:39:11.539Z
[0-0] RUNNING in chrome - /tests/selenium/specs/TemplateWizard.js
[0-0] PASSED in chrome - /tests/selenium/specs/TemplateWizard.js
"dot" Reporter:
...
Spec Files: 1 passed, 1 total (100% completed) in 00:00:11
Execution of 1 spec files started at 2022-07-08T12:39:24.454Z
[0-0] RUNNING in chrome - /tests/selenium/specs/TemplateWizard.js
[0-0] PASSED in chrome - /tests/selenium/specs/TemplateWizard.js
"dot" Reporter:
...
Spec Files: 1 passed, 1 total (100% completed) in 00:00:12
Execution of 1 spec files started at 2022-07-08T12:39:38.115Z
[0-0] RUNNING in chrome - /tests/selenium/specs/TemplateWizard.js
[0-0] PASSED in chrome - /tests/selenium/specs/TemplateWizard.js
"dot" Reporter:
...
Spec Files: 1 passed, 1 total (100% completed) in 00:00:12
Execution of 1 spec files started at 2022-07-08T12:39:52.176Z
[0-0] RUNNING in chrome - /tests/selenium/specs/TemplateWizard.js
[0-0] FAILED in chrome - /tests/selenium/specs/TemplateWizard.js
"dot" Reporter:
..
Spec Files: 0 passed, 1 failed, 1 total (100% completed) in 00:00:11
Execution of 1 spec files started at 2022-07-08T12:40:05.054Z
[0-0] RUNNING in chrome - /tests/selenium/specs/TemplateWizard.js
[0-0] PASSED in chrome - /tests/selenium/specs/TemplateWizard.js
"dot" Reporter:
...
Spec Files: 1 passed, 1 total (100% completed) in 00:00:12
Execution of 1 spec files started at 2022-07-08T12:40:18.655Z
[0-0] RUNNING in chrome - /tests/selenium/specs/TemplateWizard.js
[0-0] PASSED in chrome - /tests/selenium/specs/TemplateWizard.js
"dot" Reporter:
...
Spec Files: 1 passed, 1 total (100% completed) in 00:00:12
Execution of 1 spec files started at 2022-07-08T12:40:31.986Z
[0-0] RUNNING in chrome - /tests/selenium/specs/TemplateWizard.js
[0-0] PASSED in chrome - /tests/selenium/specs/TemplateWizard.js
"dot" Reporter:
...
Spec Files: 1 passed, 1 total (100% completed) in 00:00:12
Execution of 1 spec files started at 2022-07-08T12:40:45.745Z
[0-0] RUNNING in chrome - /tests/selenium/specs/TemplateWizard.js
[0-0] PASSED in chrome - /tests/selenium/specs/TemplateWizard.js
"dot" Reporter:
...
Spec Files: 1 passed, 1 total (100% completed) in 00:00:12
Execution of 1 spec files started at 2022-07-08T12:40:59.116Z
[0-0] RUNNING in chrome - /tests/selenium/specs/TemplateWizard.js
[0-0] PASSED in chrome - /tests/selenium/specs/TemplateWizard.js
"dot" Reporter:
...
Spec Files: 1 passed, 1 total (100% completed) in 00:00:12
Execution of 1 spec files started at 2022-07-08T12:41:12.548Z
[0-0] RUNNING in chrome - /tests/selenium/specs/TemplateWizard.js
[0-0] PASSED in chrome - /tests/selenium/specs/TemplateWizard.js
"dot" Reporter:
...
Spec Files: 1 passed, 1 total (100% completed) in 00:00:14
Execution of 1 spec files started at 2022-07-08T12:41:27.702Z
[0-0] RUNNING in chrome - /tests/selenium/specs/TemplateWizard.js
[0-0] PASSED in chrome - /tests/selenium/specs/TemplateWizard.js
"dot" Reporter:
...
Spec Files: 1 passed, 1 total (100% completed) in 00:00:13
Execution of 1 spec files started at 2022-07-08T12:41:41.897Z
[0-0] RUNNING in chrome - /tests/selenium/specs/TemplateWizard.js
[0-0] PASSED in chrome - /tests/selenium/specs/TemplateWizard.js
"dot" Reporter:
...
Spec Files: 1 passed, 1 total (100% completed) in 00:00:14
Execution of 1 spec files started at 2022-07-08T12:41:57.197Z
[0-0] RUNNING in chrome - /tests/selenium/specs/TemplateWizard.js
[0-0] PASSED in chrome - /tests/selenium/specs/TemplateWizard.js
"dot" Reporter:
...
Spec Files: 1 passed, 1 total (100% completed) in 00:00:13
Execution of 1 spec files started at 2022-07-08T12:42:11.448Z
[0-0] RUNNING in chrome - /tests/selenium/specs/TemplateWizard.js
[0-0] PASSED in chrome - /tests/selenium/specs/TemplateWizard.js
"dot" Reporter:
...
Spec Files: 1 passed, 1 total (100% completed) in 00:00:14
Execution of 1 spec files started at 2022-07-08T12:42:26.862Z
[0-0] RUNNING in chrome - /tests/selenium/specs/TemplateWizard.js
[0-0] PASSED in chrome - /tests/selenium/specs/TemplateWizard.js
"dot" Reporter:
...
Spec Files: 1 passed, 1 total (100% completed) in 00:00:13
Execution of 1 spec files started at 2022-07-08T12:42:41.586Z
[0-0] RUNNING in chrome - /tests/selenium/specs/TemplateWizard.js
[0-0] PASSED in chrome - /tests/selenium/specs/TemplateWizard.js
"dot" Reporter:
...
Spec Files: 1 passed, 1 total (100% completed) in 00:00:12
Execution of 1 spec files started at 2022-07-08T12:42:54.977Z
[0-0] RUNNING in chrome - /tests/selenium/specs/TemplateWizard.js
[0-0] FAILED in chrome - /tests/selenium/specs/TemplateWizard.js
"dot" Reporter:
.
Spec Files: 0 passed, 1 failed, 1 total (100% completed) in 00:00:08
Execution of 1 spec files started at 2022-07-08T12:43:04.815Z
[0-0] RUNNING in chrome - /tests/selenium/specs/TemplateWizard.js
[0-0] PASSED in chrome - /tests/selenium/specs/TemplateWizard.js
"dot" Reporter:
...
Spec Files: 1 passed, 1 total (100% completed) in 00:00:14
Execution of 1 spec files started at 2022-07-08T12:43:19.952Z
[0-0] RUNNING in chrome - /tests/selenium/specs/TemplateWizard.js
[0-0] PASSED in chrome - /tests/selenium/specs/TemplateWizard.js
"dot" Reporter:
...
Spec Files: 1 passed, 1 total (100% completed) in 00:00:11
Execution of 1 spec files started at 2022-07-08T12:43:32.574Z
[0-0] RUNNING in chrome - /tests/selenium/specs/TemplateWizard.js
[0-0] PASSED in chrome - /tests/selenium/specs/TemplateWizard.js
"dot" Reporter:
...
Spec Files: 1 passed, 1 total (100% completed) in 00:00:12
Execution of 1 spec files started at 2022-07-08T12:43:46.185Z
[0-0] RUNNING in chrome - /tests/selenium/specs/TemplateWizard.js
[0-0] PASSED in chrome - /tests/selenium/specs/TemplateWizard.js
"dot" Reporter:
...
Spec Files: 1 passed, 1 total (100% completed) in 00:00:12
Execution of 1 spec files started at 2022-07-08T12:43:59.467Z
[0-0] RUNNING in chrome - /tests/selenium/specs/TemplateWizard.js
[0-0] PASSED in chrome - /tests/selenium/specs/TemplateWizard.js
"dot" Reporter:
...
Spec Files: 1 passed, 1 total (100% completed) in 00:00:12
Execution of 1 spec files started at 2022-07-08T12:44:13.356Z
[0-0] RUNNING in chrome - /tests/selenium/specs/TemplateWizard.js
[0-0] PASSED in chrome - /tests/selenium/specs/TemplateWizard.js
"dot" Reporter:
...
Spec Files: 1 passed, 1 total (100% completed) in 00:00:13
Execution of 1 spec files started at 2022-07-08T12:44:27.671Z
[0-0] RUNNING in chrome - /tests/selenium/specs/TemplateWizard.js
[0-0] PASSED in chrome - /tests/selenium/specs/TemplateWizard.js
"dot" Reporter:
...
Spec Files: 1 passed, 1 total (100% completed) in 00:00:12
Execution of 1 spec files started at 2022-07-08T12:44:41.965Z
[0-0] RUNNING in chrome - /tests/selenium/specs/TemplateWizard.js
[0-0] PASSED in chrome - /tests/selenium/specs/TemplateWizard.js
"dot" Reporter:
...
Spec Files: 1 passed, 1 total (100% completed) in 00:00:13
Execution of 1 spec files started at 2022-07-08T12:44:56.822Z
[0-0] RUNNING in chrome - /tests/selenium/specs/TemplateWizard.js
[0-0] PASSED in chrome - /tests/selenium/specs/TemplateWizard.js
"dot" Reporter:
...
Spec Files: 1 passed, 1 total (100% completed) in 00:00:12
Execution of 1 spec files started at 2022-07-08T12:45:10.450Z
[0-0] RUNNING in chrome - /tests/selenium/specs/TemplateWizard.js
[0-0] FAILED in chrome - /tests/selenium/specs/TemplateWizard.js
"dot" Reporter:
..
Spec Files: 0 passed, 1 failed, 1 total (100% completed) in 00:00:11
Execution of 1 spec files started at 2022-07-08T12:45:23.086Z
[0-0] RUNNING in chrome - /tests/selenium/specs/TemplateWizard.js
[0-0] PASSED in chrome - /tests/selenium/specs/TemplateWizard.js
"dot" Reporter:
...
Spec Files: 1 passed, 1 total (100% completed) in 00:00:12
Execution of 1 spec files started at 2022-07-08T12:45:36.282Z
[0-0] RUNNING in chrome - /tests/selenium/specs/TemplateWizard.js
[0-0] PASSED in chrome - /tests/selenium/specs/TemplateWizard.js
"dot" Reporter:
...
Spec Files: 1 passed, 1 total (100% completed) in 00:00:12
Execution of 1 spec files started at 2022-07-08T12:45:50.022Z
[0-0] RUNNING in chrome - /tests/selenium/specs/TemplateWizard.js
[0-0] PASSED in chrome - /tests/selenium/specs/TemplateWizard.js
"dot" Reporter:
...
Spec Files: 1 passed, 1 total (100% completed) in 00:00:12
Execution of 1 spec files started at 2022-07-08T12:46:03.792Z
[0-0] RUNNING in chrome - /tests/selenium/specs/TemplateWizard.js
[0-0] PASSED in chrome - /tests/selenium/specs/TemplateWizard.js
"dot" Reporter:
...
Spec Files: 1 passed, 1 total (100% completed) in 00:00:12
Execution of 1 spec files started at 2022-07-08T12:46:17.677Z
[0-0] RUNNING in chrome - /tests/selenium/specs/TemplateWizard.js
[0-0] PASSED in chrome - /tests/selenium/specs/TemplateWizard.js
"dot" Reporter:
...
Spec Files: 1 passed, 1 total (100% completed) in 00:00:14
Execution of 1 spec files started at 2022-07-08T12:46:32.696Z
[0-0] RUNNING in chrome - /tests/selenium/specs/TemplateWizard.js
[0-0] PASSED in chrome - /tests/selenium/specs/TemplateWizard.js
"dot" Reporter:
...
Spec Files: 1 passed, 1 total (100% completed) in 00:00:12
Execution of 1 spec files started at 2022-07-08T12:46:46.569Z
[0-0] RUNNING in chrome - /tests/selenium/specs/TemplateWizard.js
[0-0] PASSED in chrome - /tests/selenium/specs/TemplateWizard.js
"dot" Reporter:
...
Spec Files: 1 passed, 1 total (100% completed) in 00:00:11
Execution of 1 spec files started at 2022-07-08T12:46:59.280Z
[0-0] RUNNING in chrome - /tests/selenium/specs/TemplateWizard.js
[0-0] PASSED in chrome - /tests/selenium/specs/TemplateWizard.js
"dot" Reporter:
...
Spec Files: 1 passed, 1 total (100% completed) in 00:00:12
Execution of 1 spec files started at 2022-07-08T12:47:12.378Z
[0-0] RUNNING in chrome - /tests/selenium/specs/TemplateWizard.js
[0-0] PASSED in chrome - /tests/selenium/specs/TemplateWizard.js
"dot" Reporter:
...
Spec Files: 1 passed, 1 total (100% completed) in 00:00:12
Execution of 1 spec files started at 2022-07-08T12:47:26.146Z
[0-0] RUNNING in chrome - /tests/selenium/specs/TemplateWizard.js
[0-0] PASSED in chrome - /tests/selenium/specs/TemplateWizard.js
"dot" Reporter:
...
Spec Files: 1 passed, 1 total (100% completed) in 00:00:12
Execution of 1 spec files started at 2022-07-08T12:47:40.161Z
[0-0] RUNNING in chrome - /tests/selenium/specs/TemplateWizard.js
[0-0] PASSED in chrome - /tests/selenium/specs/TemplateWizard.js
"dot" Reporter:
...
Spec Files: 1 passed, 1 total (100% completed) in 00:00:12
Execution of 1 spec files started at 2022-07-08T12:47:53.751Z
[0-0] RUNNING in chrome - /tests/selenium/specs/TemplateWizard.js
[0-0] PASSED in chrome - /tests/selenium/specs/TemplateWizard.js
"dot" Reporter:
...
Spec Files: 1 passed, 1 total (100% completed) in 00:00:12
Execution of 1 spec files started at 2022-07-08T12:48:07.375Z
[0-0] RUNNING in chrome - /tests/selenium/specs/TemplateWizard.js
[0-0] PASSED in chrome - /tests/selenium/specs/TemplateWizard.js
"dot" Reporter:
...
Spec Files: 1 passed, 1 total (100% completed) in 00:00:12
Execution of 1 spec files started at 2022-07-08T12:48:20.465Z
[0-0] RUNNING in chrome - /tests/selenium/specs/TemplateWizard.js
[0-0] PASSED in chrome - /tests/selenium/specs/TemplateWizard.js
"dot" Reporter:
...
Spec Files: 1 passed, 1 total (100% completed) in 00:00:12
Execution of 1 spec files started at 2022-07-08T12:48:33.710Z
[0-0] RUNNING in chrome - /tests/selenium/specs/TemplateWizard.js
[0-0] PASSED in chrome - /tests/selenium/specs/TemplateWizard.js
"dot" Reporter:
...
Spec Files: 1 passed, 1 total (100% completed) in 00:00:11
Execution of 1 spec files started at 2022-07-08T12:48:45.812Z
[0-0] RUNNING in chrome - /tests/selenium/specs/TemplateWizard.js
[0-0] PASSED in chrome - /tests/selenium/specs/TemplateWizard.js
"dot" Reporter:
...
Spec Files: 1 passed, 1 total (100% completed) in 00:00:12
Execution of 1 spec files started at 2022-07-08T12:48:59.723Z
[0-0] RUNNING in chrome - /tests/selenium/specs/TemplateWizard.js
[0-0] PASSED in chrome - /tests/selenium/specs/TemplateWizard.js
"dot" Reporter:
...
Spec Files: 1 passed, 1 total (100% completed) in 00:00:11
Execution of 1 spec files started at 2022-07-08T12:49:12.792Z
[0-0] RUNNING in chrome - /tests/selenium/specs/TemplateWizard.js
[0-0] PASSED in chrome - /tests/selenium/specs/TemplateWizard.js
"dot" Reporter:
...
Spec Files: 1 passed, 1 total (100% completed) in 00:00:12
Execution of 1 spec files started at 2022-07-08T12:49:26.175Z
[0-0] RUNNING in chrome - /tests/selenium/specs/TemplateWizard.js
[0-0] PASSED in chrome - /tests/selenium/specs/TemplateWizard.js
"dot" Reporter:
...
Spec Files: 1 passed, 1 total (100% completed) in 00:00:13
Execution of 1 spec files started at 2022-07-08T12:49:40.930Z
[0-0] RUNNING in chrome - /tests/selenium/specs/TemplateWizard.js
[0-0] PASSED in chrome - /tests/selenium/specs/TemplateWizard.js
"dot" Reporter:
...
Spec Files: 1 passed, 1 total (100% completed) in 00:00:12
Execution of 1 spec files started at 2022-07-08T12:49:54.077Z
[0-0] RUNNING in chrome - /tests/selenium/specs/TemplateWizard.js
[0-0] PASSED in chrome - /tests/selenium/specs/TemplateWizard.js
"dot" Reporter:
...
Spec Files: 1 passed, 1 total (100% completed) in 00:00:14
Execution of 1 spec files started at 2022-07-08T12:50:10.278Z
[0-0] RUNNING in chrome - /tests/selenium/specs/TemplateWizard.js
[0-0] PASSED in chrome - /tests/selenium/specs/TemplateWizard.js
"dot" Reporter:
...
Spec Files: 1 passed, 1 total (100% completed) in 00:00:17
Execution of 1 spec files started at 2022-07-08T12:50:29.166Z
[0-0] RUNNING in chrome - /tests/selenium/specs/TemplateWizard.js
[0-0] PASSED in chrome - /tests/selenium/specs/TemplateWizard.js
"dot" Reporter:
...
Spec Files: 1 passed, 1 total (100% completed) in 00:00:12
Execution of 1 spec files started at 2022-07-08T12:50:42.966Z
[0-0] RUNNING in chrome - /tests/selenium/specs/TemplateWizard.js
[0-0] PASSED in chrome - /tests/selenium/specs/TemplateWizard.js
"dot" Reporter:
...
Spec Files: 1 passed, 1 total (100% completed) in 00:00:12
Execution of 1 spec files started at 2022-07-08T12:50:56.689Z
[0-0] RUNNING in chrome - /tests/selenium/specs/TemplateWizard.js
[0-0] PASSED in chrome - /tests/selenium/specs/TemplateWizard.js
"dot" Reporter:
...
Spec Files: 1 passed, 1 total (100% completed) in 00:00:12
Execution of 1 spec files started at 2022-07-08T12:51:09.948Z
[0-0] RUNNING in chrome - /tests/selenium/specs/TemplateWizard.js
[0-0] PASSED in chrome - /tests/selenium/specs/TemplateWizard.js
"dot" Reporter:
...
Spec Files: 1 passed, 1 total (100% completed) in 00:00:12
Execution of 1 spec files started at 2022-07-08T12:51:23.910Z
[0-0] RUNNING in chrome - /tests/selenium/specs/TemplateWizard.js
[0-0] PASSED in chrome - /tests/selenium/specs/TemplateWizard.js
"dot" Reporter:
...
Spec Files: 1 passed, 1 total (100% completed) in 00:00:12
Execution of 1 spec files started at 2022-07-08T12:51:37.772Z
[0-0] RUNNING in chrome - /tests/selenium/specs/TemplateWizard.js
[0-0] PASSED in chrome - /tests/selenium/specs/TemplateWizard.js
"dot" Reporter:
...
Spec Files: 1 passed, 1 total (100% completed) in 00:00:11
Execution of 1 spec files started at 2022-07-08T12:51:50.678Z
[0-0] RUNNING in chrome - /tests/selenium/specs/TemplateWizard.js
[0-0] PASSED in chrome - /tests/selenium/specs/TemplateWizard.js
"dot" Reporter:
...
Spec Files: 1 passed, 1 total (100% completed) in 00:00:11
Execution of 1 spec files started at 2022-07-08T12:52:03.830Z
[0-0] RUNNING in chrome - /tests/selenium/specs/TemplateWizard.js
[0-0] PASSED in chrome - /tests/selenium/specs/TemplateWizard.js
"dot" Reporter:
...
Spec Files: 1 passed, 1 total (100% completed) in 00:00:12
Execution of 1 spec files started at 2022-07-08T12:52:16.982Z
[0-0] RUNNING in chrome - /tests/selenium/specs/TemplateWizard.js
[0-0] PASSED in chrome - /tests/selenium/specs/TemplateWizard.js
"dot" Reporter:
...
Spec Files: 1 passed, 1 total (100% completed) in 00:00:13
Execution of 1 spec files started at 2022-07-08T12:52:31.619Z
[0-0] RUNNING in chrome - /tests/selenium/specs/TemplateWizard.js
[0-0] PASSED in chrome - /tests/selenium/specs/TemplateWizard.js
"dot" Reporter:
...
Spec Files: 1 passed, 1 total (100% completed) in 00:00:14
Execution of 1 spec files started at 2022-07-08T12:52:47.839Z
[0-0] RUNNING in chrome - /tests/selenium/specs/TemplateWizard.js
[0-0] PASSED in chrome - /tests/selenium/specs/TemplateWizard.js
"dot" Reporter:
...
Spec Files: 1 passed, 1 total (100% completed) in 00:00:12
Execution of 1 spec files started at 2022-07-08T12:53:01.418Z
[0-0] RUNNING in chrome - /tests/selenium/specs/TemplateWizard.js
[0-0] FAILED in chrome - /tests/selenium/specs/TemplateWizard.js
Spec Files: 0 passed, 1 failed, 1 total (100% completed) in 00:00:04
Execution of 1 spec files started at 2022-07-08T12:53:08.154Z
[0-0] RUNNING in chrome - /tests/selenium/specs/TemplateWizard.js
[0-0] PASSED in chrome - /tests/selenium/specs/TemplateWizard.js
"dot" Reporter:
...
Spec Files: 1 passed, 1 total (100% completed) in 00:00:12
Execution of 1 spec files started at 2022-07-08T12:53:22.220Z
[0-0] RUNNING in chrome - /tests/selenium/specs/TemplateWizard.js
[0-0] PASSED in chrome - /tests/selenium/specs/TemplateWizard.js
"dot" Reporter:
...
Spec Files: 1 passed, 1 total (100% completed) in 00:00:11
Execution of 1 spec files started at 2022-07-08T12:53:35.174Z
[0-0] RUNNING in chrome - /tests/selenium/specs/TemplateWizard.js
[0-0] PASSED in chrome - /tests/selenium/specs/TemplateWizard.js
"dot" Reporter:
...
Spec Files: 1 passed, 1 total (100% completed) in 00:00:11
Execution of 1 spec files started at 2022-07-08T12:53:47.911Z
[0-0] RUNNING in chrome - /tests/selenium/specs/TemplateWizard.js
[0-0] PASSED in chrome - /tests/selenium/specs/TemplateWizard.js
"dot" Reporter:
...
Spec Files: 1 passed, 1 total (100% completed) in 00:00:12
Execution of 1 spec files started at 2022-07-08T12:54:01.559Z
[0-0] RUNNING in chrome - /tests/selenium/specs/TemplateWizard.js
[0-0] PASSED in chrome - /tests/selenium/specs/TemplateWizard.js
"dot" Reporter:
...
Spec Files: 1 passed, 1 total (100% completed) in 00:00:12
Execution of 1 spec files started at 2022-07-08T12:54:15.056Z
[0-0] RUNNING in chrome - /tests/selenium/specs/TemplateWizard.js
[0-0] PASSED in chrome - /tests/selenium/specs/TemplateWizard.js
"dot" Reporter:
...
Spec Files: 1 passed, 1 total (100% completed) in 00:00:12
Execution of 1 spec files started at 2022-07-08T12:54:28.486Z
[0-0] RUNNING in chrome - /tests/selenium/specs/TemplateWizard.js
[0-0] PASSED in chrome - /tests/selenium/specs/TemplateWizard.js
"dot" Reporter:
...
Spec Files: 1 passed, 1 total (100% completed) in 00:00:15
Execution of 1 spec files started at 2022-07-08T12:54:44.715Z
[0-0] RUNNING in chrome - /tests/selenium/specs/TemplateWizard.js
[0-0] PASSED in chrome - /tests/selenium/specs/TemplateWizard.js
"dot" Reporter:
...
Spec Files: 1 passed, 1 total (100% completed) in 00:00:13
Execution of 1 spec files started at 2022-07-08T12:54:59.031Z
[0-0] RUNNING in chrome - /tests/selenium/specs/TemplateWizard.js
[0-0] PASSED in chrome - /tests/selenium/specs/TemplateWizard.js
"dot" Reporter:
...
Spec Files: 1 passed, 1 total (100% completed) in 00:00:13
Execution of 1 spec files started at 2022-07-08T12:55:13.338Z
[0-0] RUNNING in chrome - /tests/selenium/specs/TemplateWizard.js
[0-0] PASSED in chrome - /tests/selenium/specs/TemplateWizard.js
"dot" Reporter:
...
Spec Files: 1 passed, 1 total (100% completed) in 00:00:13
Execution of 1 spec files started at 2022-07-08T12:55:27.569Z
[0-0] RUNNING in chrome - /tests/selenium/specs/TemplateWizard.js
[0-0] PASSED in chrome - /tests/selenium/specs/TemplateWizard.js
"dot" Reporter:
...
Spec Files: 1 passed, 1 total (100% completed) in 00:00:12
Execution of 1 spec files started at 2022-07-08T12:55:40.895Z
[0-0] RUNNING in chrome - /tests/selenium/specs/TemplateWizard.js
[0-0] PASSED in chrome - /tests/selenium/specs/TemplateWizard.js
"dot" Reporter:
...
Spec Files: 1 passed, 1 total (100% completed) in 00:00:12
Execution of 1 spec files started at 2022-07-08T12:55:54.211Z
[0-0] RUNNING in chrome - /tests/selenium/specs/TemplateWizard.js
[0-0] PASSED in chrome - /tests/selenium/specs/TemplateWizard.js
"dot" Reporter:
...
Spec Files: 1 passed, 1 total (100% completed) in 00:00:12
Execution of 1 spec files started at 2022-07-08T12:56:07.298Z
[0-0] RUNNING in chrome - /tests/selenium/specs/TemplateWizard.js
[0-0] PASSED in chrome - /tests/selenium/specs/TemplateWizard.js
"dot" Reporter:
...
Spec Files: 1 passed, 1 total (100% completed) in 00:00:11
Execution of 1 spec files started at 2022-07-08T12:56:20.308Z
[0-0] RUNNING in chrome - /tests/selenium/specs/TemplateWizard.js
[0-0] PASSED in chrome - /tests/selenium/specs/TemplateWizard.js
"dot" Reporter:
...
Spec Files: 1 passed, 1 total (100% completed) in 00:00:12
Execution of 1 spec files started at 2022-07-08T12:56:33.950Z
[0-0] RUNNING in chrome - /tests/selenium/specs/TemplateWizard.js
[0-0] PASSED in chrome - /tests/selenium/specs/TemplateWizard.js
"dot" Reporter:
...
Spec Files: 1 passed, 1 total (100% completed) in 00:00:12
Execution of 1 spec files started at 2022-07-08T12:56:47.592Z
[0-0] RUNNING in chrome - /tests/selenium/specs/TemplateWizard.js
[0-0] PASSED in chrome - /tests/selenium/specs/TemplateWizard.js
"dot" Reporter:
...
Spec Files: 1 passed, 1 total (100% completed) in 00:00:11
Execution of 1 spec files started at 2022-07-08T12:56:59.766Z
[0-0] RUNNING in chrome - /tests/selenium/specs/TemplateWizard.js
[0-0] PASSED in chrome - /tests/selenium/specs/TemplateWizard.js
"dot" Reporter:
...
Spec Files: 1 passed, 1 total (100% completed) in 00:00:12
Execution of 1 spec files started at 2022-07-08T12:57:13.248Z
[0-0] RUNNING in chrome - /tests/selenium/specs/TemplateWizard.js
[0-0] PASSED in chrome - /tests/selenium/specs/TemplateWizard.js
"dot" Reporter:
...
Spec Files: 1 passed, 1 total (100% completed) in 00:00:11
Execution of 1 spec files started at 2022-07-08T12:57:26.041Z
[0-0] RUNNING in chrome - /tests/selenium/specs/TemplateWizard.js
[0-0] PASSED in chrome - /tests/selenium/specs/TemplateWizard.js
"dot" Reporter:
...
Spec Files: 1 passed, 1 total (100% completed) in 00:00:13
Execution of 1 spec files started at 2022-07-08T12:57:40.748Z
[0-0] RUNNING in chrome - /tests/selenium/specs/TemplateWizard.js
[0-0] PASSED in chrome - /tests/selenium/specs/TemplateWizard.js
"dot" Reporter:
...
Spec Files: 1 passed, 1 total (100% completed) in 00:00:11
Execution of 1 spec files started at 2022-07-08T12:57:53.385Z
[0-0] RUNNING in chrome - /tests/selenium/specs/TemplateWizard.js
[0-0] PASSED in chrome - /tests/selenium/specs/TemplateWizard.js
"dot" Reporter:
...
Spec Files: 1 passed, 1 total (100% completed) in 00:00:11
Execution of 1 spec files started at 2022-07-08T12:58:06.408Z
[0-0] RUNNING in chrome - /tests/selenium/specs/TemplateWizard.js
[0-0] PASSED in chrome - /tests/selenium/specs/TemplateWizard.js
"dot" Reporter:
...
Spec Files: 1 passed, 1 total (100% completed) in 00:00:12
Execution of 1 spec files started at 2022-07-08T12:58:20.253Z
[0-0] RUNNING in chrome - /tests/selenium/specs/TemplateWizard.js
[0-0] PASSED in chrome - /tests/selenium/specs/TemplateWizard.js
"dot" Reporter:
...
Spec Files: 1 passed, 1 total (100% completed) in 00:00:12
Execution of 1 spec files started at 2022-07-08T12:58:33.825Z
[0-0] RUNNING in chrome - /tests/selenium/specs/TemplateWizard.js
[0-0] PASSED in chrome - /tests/selenium/specs/TemplateWizard.js
"dot" Reporter:
...
Spec Files: 1 passed, 1 total (100% completed) in 00:00:12
Execution of 1 spec files started at 2022-07-08T12:58:47.605Z
[0-0] RUNNING in chrome - /tests/selenium/specs/TemplateWizard.js
[0-0] PASSED in chrome - /tests/selenium/specs/TemplateWizard.js
"dot" Reporter:
...
Spec Files: 1 passed, 1 total (100% completed) in 00:00:12
Execution of 1 spec files started at 2022-07-08T12:59:01.221Z
[0-0] RUNNING in chrome - /tests/selenium/specs/TemplateWizard.js
[0-0] PASSED in chrome - /tests/selenium/specs/TemplateWizard.js
"dot" Reporter:
...
Spec Files: 1 passed, 1 total (100% completed) in 00:00:12
Execution of 1 spec files started at 2022-07-08T12:59:14.715Z
[0-0] RUNNING in chrome - /tests/selenium/specs/TemplateWizard.js
[0-0] PASSED in chrome - /tests/selenium/specs/TemplateWizard.js
"dot" Reporter:
...
Spec Files: 1 passed, 1 total (100% completed) in 00:00:12
Execution of 1 spec files started at 2022-07-08T12:59:28.298Z
[0-0] RUNNING in chrome - /tests/selenium/specs/TemplateWizard.js
[0-0] FAILED in chrome - /tests/selenium/specs/TemplateWizard.js
Spec Files: 0 passed, 1 failed, 1 total (100% completed) in 00:00:04
Execution of 1 spec files started at 2022-07-08T12:59:34.303Z
[0-0] RUNNING in chrome - /tests/selenium/specs/TemplateWizard.js
[0-0] PASSED in chrome - /tests/selenium/specs/TemplateWizard.js
"dot" Reporter:
...
Spec Files: 1 passed, 1 total (100% completed) in 00:00:12
Execution of 1 spec files started at 2022-07-08T12:59:47.772Z
[0-0] RUNNING in chrome - /tests/selenium/specs/TemplateWizard.js
[0-0] FAILED in chrome - /tests/selenium/specs/TemplateWizard.js
"dot" Reporter:
..
Spec Files: 0 passed, 1 failed, 1 total (100% completed) in 00:00:12
Execution of 1 spec files started at 2022-07-08T13:00:01.082Z
[0-0] RUNNING in chrome - /tests/selenium/specs/TemplateWizard.js
[0-0] FAILED in chrome - /tests/selenium/specs/TemplateWizard.js
"dot" Reporter:
..
Spec Files: 0 passed, 1 failed, 1 total (100% completed) in 00:00:11
Execution of 1 spec files started at 2022-07-08T13:00:13.801Z
[0-0] RUNNING in chrome - /tests/selenium/specs/TemplateWizard.js
[0-0] PASSED in chrome - /tests/selenium/specs/TemplateWizard.js
"dot" Reporter:
...
Spec Files: 1 passed, 1 total (100% completed) in 00:00:12
Execution of 1 spec files started at 2022-07-08T13:00:27.510Z
[0-0] RUNNING in chrome - /tests/selenium/specs/TemplateWizard.js
[0-0] FAILED in chrome - /tests/selenium/specs/TemplateWizard.js
Spec Files: 0 passed, 1 failed, 1 total (100% completed) in 00:00:05
Execution of 1 spec files started at 2022-07-08T13:00:33.556Z
[0-0] RUNNING in chrome - /tests/selenium/specs/TemplateWizard.js
[0-0] PASSED in chrome - /tests/selenium/specs/TemplateWizard.js
"dot" Reporter:
...
Spec Files: 1 passed, 1 total (100% completed) in 00:00:12
Execution of 1 spec files started at 2022-07-08T13:00:47.122Z
[0-0] RUNNING in chrome - /tests/selenium/specs/TemplateWizard.js
[0-0] PASSED in chrome - /tests/selenium/specs/TemplateWizard.js
"dot" Reporter:
...
Spec Files: 1 passed, 1 total (100% completed) in 00:00:13
Execution of 1 spec files started at 2022-07-08T13:01:01.470Z
[0-0] RUNNING in chrome - /tests/selenium/specs/TemplateWizard.js
[0-0] PASSED in chrome - /tests/selenium/specs/TemplateWizard.js
"dot" Reporter:
...
Spec Files: 1 passed, 1 total (100% completed) in 00:00:12
Execution of 1 spec files started at 2022-07-08T13:01:14.681Z
[0-0] RUNNING in chrome - /tests/selenium/specs/TemplateWizard.js
[0-0] PASSED in chrome - /tests/selenium/specs/TemplateWizard.js
"dot" Reporter:
...
Spec Files: 1 passed, 1 total (100% completed) in 00:00:12