Page MenuHomePhabricator
Paste P5209

(An Untitled Masterwork)
ActivePublic

Authored by Paladox on Apr 5 2017, 9:43 AM.
23:11:51 There were 27 errors:
23:11:51
23:11:51 1) BSApiTasksInterWikiLinksManagerTest::testEditInterWikiLink
23:11:51 MWException: When testing database state, the test cases's needDB() method should return true. Use @group Database or $this->tablesUsed.
23:11:51
23:11:51 /home/jenkins/workspace/mwext-testextension-hhvm-composer-jessie-non-voting/src/tests/phpunit/MediaWikiTestCase.php:1430
23:11:51 /home/jenkins/workspace/mwext-testextension-hhvm-composer-jessie-non-voting/src/extensions/BlueSpiceExtensions/InterWikiLinks/tests/phpunit/BSApiTasksInterWikiLinksManagerTest.php:27
23:11:51 /home/jenkins/workspace/mwext-testextension-hhvm-composer-jessie-non-voting/src/tests/phpunit/MediaWikiTestCase.php:400
23:11:51 /home/jenkins/workspace/mwext-testextension-hhvm-composer-jessie-non-voting/src/maintenance/doMaintenance.php:111
23:11:51
23:11:51 2) ApiPermissionManagerTest::testSavePermissions
23:11:51 Undefined index: bsPermissionManagerPermissionLockdown
23:11:51
23:11:51 /home/jenkins/workspace/mwext-testextension-hhvm-composer-jessie-non-voting/src/extensions/BlueSpiceExtensions/PermissionManager/tests/phpunit/ApiPermissionManagerTest.php:41
23:11:51 /home/jenkins/workspace/mwext-testextension-hhvm-composer-jessie-non-voting/src/tests/phpunit/MediaWikiTestCase.php:400
23:11:51 /home/jenkins/workspace/mwext-testextension-hhvm-composer-jessie-non-voting/src/maintenance/doMaintenance.php:111
23:11:51
23:11:51 3) ApiPermissionManagerTest::testSetTemplateData
23:11:51 ApiUsageException: Permission denied.
23:11:51
23:11:51 /home/jenkins/workspace/mwext-testextension-hhvm-composer-jessie-non-voting/src/includes/api/ApiUsageException.php:145
23:11:51 /home/jenkins/workspace/mwext-testextension-hhvm-composer-jessie-non-voting/src/includes/api/ApiBase.php:1779
23:11:51 /home/jenkins/workspace/mwext-testextension-hhvm-composer-jessie-non-voting/src/extensions/BlueSpiceFoundation/includes/api/BSApiTasksBase.php:137
23:11:51 /home/jenkins/workspace/mwext-testextension-hhvm-composer-jessie-non-voting/src/includes/api/ApiMain.php:1543
23:11:51 /home/jenkins/workspace/mwext-testextension-hhvm-composer-jessie-non-voting/src/includes/api/ApiMain.php:513
23:11:51 /home/jenkins/workspace/mwext-testextension-hhvm-composer-jessie-non-voting/src/tests/phpunit/includes/api/ApiTestCase.php:99
23:11:51 /home/jenkins/workspace/mwext-testextension-hhvm-composer-jessie-non-voting/src/tests/phpunit/includes/api/ApiTestCase.php:146
23:11:51 /home/jenkins/workspace/mwext-testextension-hhvm-composer-jessie-non-voting/src/extensions/BlueSpiceFoundation/tests/BSApiTasksTestBase.php:22
23:11:51 /home/jenkins/workspace/mwext-testextension-hhvm-composer-jessie-non-voting/src/extensions/BlueSpiceExtensions/PermissionManager/tests/phpunit/ApiPermissionManagerTest.php:73
23:11:51 /home/jenkins/workspace/mwext-testextension-hhvm-composer-jessie-non-voting/src/tests/phpunit/MediaWikiTestCase.php:400
23:11:51 /home/jenkins/workspace/mwext-testextension-hhvm-composer-jessie-non-voting/src/maintenance/doMaintenance.php:111
23:11:51
23:11:51 4) ApiPermissionManagerTest::testDeleteTemplate
23:11:51 ApiUsageException: Permission denied.
23:11:51
23:11:51 /home/jenkins/workspace/mwext-testextension-hhvm-composer-jessie-non-voting/src/includes/api/ApiUsageException.php:145
23:11:51 /home/jenkins/workspace/mwext-testextension-hhvm-composer-jessie-non-voting/src/includes/api/ApiBase.php:1779
23:11:51 /home/jenkins/workspace/mwext-testextension-hhvm-composer-jessie-non-voting/src/extensions/BlueSpiceFoundation/includes/api/BSApiTasksBase.php:137
23:11:51 /home/jenkins/workspace/mwext-testextension-hhvm-composer-jessie-non-voting/src/includes/api/ApiMain.php:1543
23:11:51 /home/jenkins/workspace/mwext-testextension-hhvm-composer-jessie-non-voting/src/includes/api/ApiMain.php:513
23:11:51 /home/jenkins/workspace/mwext-testextension-hhvm-composer-jessie-non-voting/src/tests/phpunit/includes/api/ApiTestCase.php:99
23:11:51 /home/jenkins/workspace/mwext-testextension-hhvm-composer-jessie-non-voting/src/tests/phpunit/includes/api/ApiTestCase.php:146
23:11:51 /home/jenkins/workspace/mwext-testextension-hhvm-composer-jessie-non-voting/src/extensions/BlueSpiceFoundation/tests/BSApiTasksTestBase.php:22
23:11:51 /home/jenkins/workspace/mwext-testextension-hhvm-composer-jessie-non-voting/src/extensions/BlueSpiceExtensions/PermissionManager/tests/phpunit/ApiPermissionManagerTest.php:110
23:11:51 /home/jenkins/workspace/mwext-testextension-hhvm-composer-jessie-non-voting/src/tests/phpunit/MediaWikiTestCase.php:400
23:11:51 /home/jenkins/workspace/mwext-testextension-hhvm-composer-jessie-non-voting/src/maintenance/doMaintenance.php:111
23:11:51
23:11:51 5) ApiPermissionManagerTest::testPermissions
23:11:51 ApiUsageException: Permission denied.
23:11:51
23:11:51 /home/jenkins/workspace/mwext-testextension-hhvm-composer-jessie-non-voting/src/includes/api/ApiUsageException.php:145
23:11:51 /home/jenkins/workspace/mwext-testextension-hhvm-composer-jessie-non-voting/src/includes/api/ApiBase.php:1779
23:11:51 /home/jenkins/workspace/mwext-testextension-hhvm-composer-jessie-non-voting/src/extensions/BlueSpiceFoundation/includes/api/BSApiTasksBase.php:137
23:11:51 /home/jenkins/workspace/mwext-testextension-hhvm-composer-jessie-non-voting/src/includes/api/ApiMain.php:1543
23:11:51 /home/jenkins/workspace/mwext-testextension-hhvm-composer-jessie-non-voting/src/includes/api/ApiMain.php:513
23:11:51 /home/jenkins/workspace/mwext-testextension-hhvm-composer-jessie-non-voting/src/tests/phpunit/includes/api/ApiTestCase.php:99
23:11:51 /home/jenkins/workspace/mwext-testextension-hhvm-composer-jessie-non-voting/src/tests/phpunit/includes/api/ApiTestCase.php:146
23:11:51 /home/jenkins/workspace/mwext-testextension-hhvm-composer-jessie-non-voting/src/extensions/BlueSpiceFoundation/tests/BSApiTasksTestBase.php:22
23:11:51 /home/jenkins/workspace/mwext-testextension-hhvm-composer-jessie-non-voting/src/extensions/BlueSpiceExtensions/PermissionManager/tests/phpunit/ApiPermissionManagerTest.php:130
23:11:51 /home/jenkins/workspace/mwext-testextension-hhvm-composer-jessie-non-voting/src/tests/phpunit/MediaWikiTestCase.php:400
23:11:51 /home/jenkins/workspace/mwext-testextension-hhvm-composer-jessie-non-voting/src/maintenance/doMaintenance.php:111
23:11:51
23:11:51 6) BSApiChangeableGroupStoreTest::testSchema
23:11:51 Undefined index: 0
23:11:51
23:11:51 /home/jenkins/workspace/mwext-testextension-hhvm-composer-jessie-non-voting/src/extensions/BlueSpiceFoundation/tests/BSApiExtJSStoreTestBase.php:34
23:11:51 /home/jenkins/workspace/mwext-testextension-hhvm-composer-jessie-non-voting/src/tests/phpunit/MediaWikiTestCase.php:400
23:11:51 /home/jenkins/workspace/mwext-testextension-hhvm-composer-jessie-non-voting/src/maintenance/doMaintenance.php:111
23:11:51
23:11:51 7) BSApiTasksUserManagerTest::testAddUser
23:11:51 ApiUsageException: Permission denied.
23:11:51
23:11:51 /home/jenkins/workspace/mwext-testextension-hhvm-composer-jessie-non-voting/src/includes/api/ApiUsageException.php:145
23:11:51 /home/jenkins/workspace/mwext-testextension-hhvm-composer-jessie-non-voting/src/includes/api/ApiBase.php:1779
23:11:51 /home/jenkins/workspace/mwext-testextension-hhvm-composer-jessie-non-voting/src/extensions/BlueSpiceFoundation/includes/api/BSApiTasksBase.php:137
23:11:51 /home/jenkins/workspace/mwext-testextension-hhvm-composer-jessie-non-voting/src/includes/api/ApiMain.php:1543
23:11:51 /home/jenkins/workspace/mwext-testextension-hhvm-composer-jessie-non-voting/src/includes/api/ApiMain.php:513
23:11:51 /home/jenkins/workspace/mwext-testextension-hhvm-composer-jessie-non-voting/src/tests/phpunit/includes/api/ApiTestCase.php:99
23:11:51 /home/jenkins/workspace/mwext-testextension-hhvm-composer-jessie-non-voting/src/tests/phpunit/includes/api/ApiTestCase.php:146
23:11:51 /home/jenkins/workspace/mwext-testextension-hhvm-composer-jessie-non-voting/src/extensions/BlueSpiceFoundation/tests/BSApiTasksTestBase.php:22
23:11:51 /home/jenkins/workspace/mwext-testextension-hhvm-composer-jessie-non-voting/src/extensions/BlueSpiceExtensions/UserManager/tests/phpunit/BSApiTasksUserManagerTest.php:25
23:11:51 /home/jenkins/workspace/mwext-testextension-hhvm-composer-jessie-non-voting/src/tests/phpunit/MediaWikiTestCase.php:400
23:11:51 /home/jenkins/workspace/mwext-testextension-hhvm-composer-jessie-non-voting/src/maintenance/doMaintenance.php:111
23:11:51
23:11:51 8) BSApiTasksUserManagerTest::testEditUser
23:11:51 ApiUsageException: Permission denied.
23:11:51
23:11:51 /home/jenkins/workspace/mwext-testextension-hhvm-composer-jessie-non-voting/src/includes/api/ApiUsageException.php:145
23:11:51 /home/jenkins/workspace/mwext-testextension-hhvm-composer-jessie-non-voting/src/includes/api/ApiBase.php:1779
23:11:51 /home/jenkins/workspace/mwext-testextension-hhvm-composer-jessie-non-voting/src/extensions/BlueSpiceFoundation/includes/api/BSApiTasksBase.php:137
23:11:51 /home/jenkins/workspace/mwext-testextension-hhvm-composer-jessie-non-voting/src/includes/api/ApiMain.php:1543
23:11:51 /home/jenkins/workspace/mwext-testextension-hhvm-composer-jessie-non-voting/src/includes/api/ApiMain.php:513
23:11:51 /home/jenkins/workspace/mwext-testextension-hhvm-composer-jessie-non-voting/src/tests/phpunit/includes/api/ApiTestCase.php:99
23:11:51 /home/jenkins/workspace/mwext-testextension-hhvm-composer-jessie-non-voting/src/tests/phpunit/includes/api/ApiTestCase.php:146
23:11:51 /home/jenkins/workspace/mwext-testextension-hhvm-composer-jessie-non-voting/src/extensions/BlueSpiceFoundation/tests/BSApiTasksTestBase.php:22
23:11:51 /home/jenkins/workspace/mwext-testextension-hhvm-composer-jessie-non-voting/src/extensions/BlueSpiceExtensions/UserManager/tests/phpunit/BSApiTasksUserManagerTest.php:47
23:11:51 /home/jenkins/workspace/mwext-testextension-hhvm-composer-jessie-non-voting/src/tests/phpunit/MediaWikiTestCase.php:400
23:11:51 /home/jenkins/workspace/mwext-testextension-hhvm-composer-jessie-non-voting/src/maintenance/doMaintenance.php:111
23:11:51
23:11:51 9) BSApiTasksUserManagerTest::testDisableUser
23:11:51 ApiUsageException: Permission denied.
23:11:51
23:11:51 /home/jenkins/workspace/mwext-testextension-hhvm-composer-jessie-non-voting/src/includes/api/ApiUsageException.php:145
23:11:51 /home/jenkins/workspace/mwext-testextension-hhvm-composer-jessie-non-voting/src/includes/api/ApiBase.php:1779
23:11:51 /home/jenkins/workspace/mwext-testextension-hhvm-composer-jessie-non-voting/src/extensions/BlueSpiceFoundation/includes/api/BSApiTasksBase.php:137
23:11:51 /home/jenkins/workspace/mwext-testextension-hhvm-composer-jessie-non-voting/src/includes/api/ApiMain.php:1543
23:11:51 /home/jenkins/workspace/mwext-testextension-hhvm-composer-jessie-non-voting/src/includes/api/ApiMain.php:513
23:11:51 /home/jenkins/workspace/mwext-testextension-hhvm-composer-jessie-non-voting/src/tests/phpunit/includes/api/ApiTestCase.php:99
23:11:51 /home/jenkins/workspace/mwext-testextension-hhvm-composer-jessie-non-voting/src/tests/phpunit/includes/api/ApiTestCase.php:146
23:11:51 /home/jenkins/workspace/mwext-testextension-hhvm-composer-jessie-non-voting/src/extensions/BlueSpiceFoundation/tests/BSApiTasksTestBase.php:22
23:11:51 /home/jenkins/workspace/mwext-testextension-hhvm-composer-jessie-non-voting/src/extensions/BlueSpiceExtensions/UserManager/tests/phpunit/BSApiTasksUserManagerTest.php:63
23:11:51 /home/jenkins/workspace/mwext-testextension-hhvm-composer-jessie-non-voting/src/tests/phpunit/MediaWikiTestCase.php:400
23:11:51 /home/jenkins/workspace/mwext-testextension-hhvm-composer-jessie-non-voting/src/maintenance/doMaintenance.php:111
23:11:51
23:11:51 10) BSApiTasksUserManagerTest::testEnableUser
23:11:51 ApiUsageException: Permission denied.
23:11:51
23:11:51 /home/jenkins/workspace/mwext-testextension-hhvm-composer-jessie-non-voting/src/includes/api/ApiUsageException.php:145
23:11:51 /home/jenkins/workspace/mwext-testextension-hhvm-composer-jessie-non-voting/src/includes/api/ApiBase.php:1779
23:11:51 /home/jenkins/workspace/mwext-testextension-hhvm-composer-jessie-non-voting/src/extensions/BlueSpiceFoundation/includes/api/BSApiTasksBase.php:137
23:11:51 /home/jenkins/workspace/mwext-testextension-hhvm-composer-jessie-non-voting/src/includes/api/ApiMain.php:1543
23:11:51 /home/jenkins/workspace/mwext-testextension-hhvm-composer-jessie-non-voting/src/includes/api/ApiMain.php:513
23:11:51 /home/jenkins/workspace/mwext-testextension-hhvm-composer-jessie-non-voting/src/tests/phpunit/includes/api/ApiTestCase.php:99
23:11:51 /home/jenkins/workspace/mwext-testextension-hhvm-composer-jessie-non-voting/src/tests/phpunit/includes/api/ApiTestCase.php:146
23:11:51 /home/jenkins/workspace/mwext-testextension-hhvm-composer-jessie-non-voting/src/extensions/BlueSpiceFoundation/tests/BSApiTasksTestBase.php:22
23:11:51 /home/jenkins/workspace/mwext-testextension-hhvm-composer-jessie-non-voting/src/extensions/BlueSpiceExtensions/UserManager/tests/phpunit/BSApiTasksUserManagerTest.php:74
23:11:51 /home/jenkins/workspace/mwext-testextension-hhvm-composer-jessie-non-voting/src/tests/phpunit/MediaWikiTestCase.php:400
23:11:51 /home/jenkins/workspace/mwext-testextension-hhvm-composer-jessie-non-voting/src/maintenance/doMaintenance.php:111
23:11:51
23:11:51 11) BSApiTasksUserManagerTest::testDeleteUser
23:11:51 ApiUsageException: Permission denied.
23:11:51
23:11:51 /home/jenkins/workspace/mwext-testextension-hhvm-composer-jessie-non-voting/src/includes/api/ApiUsageException.php:145
23:11:51 /home/jenkins/workspace/mwext-testextension-hhvm-composer-jessie-non-voting/src/includes/api/ApiBase.php:1779
23:11:51 /home/jenkins/workspace/mwext-testextension-hhvm-composer-jessie-non-voting/src/extensions/BlueSpiceFoundation/includes/api/BSApiTasksBase.php:137
23:11:51 /home/jenkins/workspace/mwext-testextension-hhvm-composer-jessie-non-voting/src/includes/api/ApiMain.php:1543
23:11:51 /home/jenkins/workspace/mwext-testextension-hhvm-composer-jessie-non-voting/src/includes/api/ApiMain.php:513
23:11:51 /home/jenkins/workspace/mwext-testextension-hhvm-composer-jessie-non-voting/src/tests/phpunit/includes/api/ApiTestCase.php:99
23:11:51 /home/jenkins/workspace/mwext-testextension-hhvm-composer-jessie-non-voting/src/tests/phpunit/includes/api/ApiTestCase.php:146
23:11:51 /home/jenkins/workspace/mwext-testextension-hhvm-composer-jessie-non-voting/src/extensions/BlueSpiceFoundation/tests/BSApiTasksTestBase.php:22
23:11:51 /home/jenkins/workspace/mwext-testextension-hhvm-composer-jessie-non-voting/src/extensions/BlueSpiceExtensions/UserManager/tests/phpunit/BSApiTasksUserManagerTest.php:85
23:11:51 /home/jenkins/workspace/mwext-testextension-hhvm-composer-jessie-non-voting/src/tests/phpunit/MediaWikiTestCase.php:400
23:11:51 /home/jenkins/workspace/mwext-testextension-hhvm-composer-jessie-non-voting/src/maintenance/doMaintenance.php:111
23:11:51
23:11:51 12) BSApiChecklistTasksTest::testTask_doChangeCheckItem
23:11:51 Compilation failed: two named subpatterns have the same name at offset 594
23:11:51
23:11:51 /home/jenkins/workspace/mwext-testextension-hhvm-composer-jessie-non-voting/src/includes/MagicWordArray.php:275
23:11:51 /home/jenkins/workspace/mwext-testextension-hhvm-composer-jessie-non-voting/src/includes/parser/Parser.php:3994
23:11:51 /home/jenkins/workspace/mwext-testextension-hhvm-composer-jessie-non-voting/src/includes/parser/Parser.php:1319
23:11:51 /home/jenkins/workspace/mwext-testextension-hhvm-composer-jessie-non-voting/src/includes/parser/Parser.php:451
23:11:51 /home/jenkins/workspace/mwext-testextension-hhvm-composer-jessie-non-voting/src/includes/content/WikitextContent.php:330
23:11:51 /home/jenkins/workspace/mwext-testextension-hhvm-composer-jessie-non-voting/src/includes/content/AbstractContent.php:497
23:11:51 /home/jenkins/workspace/mwext-testextension-hhvm-composer-jessie-non-voting/src/includes/page/WikiPage.php:2069
23:11:51 /home/jenkins/workspace/mwext-testextension-hhvm-composer-jessie-non-voting/src/extensions/BlueSpiceExtensions/PageAccess/PageAccess.class.php:59
23:11:51 /home/jenkins/workspace/mwext-testextension-hhvm-composer-jessie-non-voting/src/includes/Hooks.php:186
23:11:51 /home/jenkins/workspace/mwext-testextension-hhvm-composer-jessie-non-voting/src/includes/page/WikiPage.php:1568
23:11:51 /home/jenkins/workspace/mwext-testextension-hhvm-composer-jessie-non-voting/src/tests/phpunit/MediaWikiTestCase.php:970
23:11:51 /home/jenkins/workspace/mwext-testextension-hhvm-composer-jessie-non-voting/src/extensions/BlueSpiceExtensions/Checklist/tests/phpunit/BSApiChecklistTasksTest.php:29
23:11:51 /home/jenkins/workspace/mwext-testextension-hhvm-composer-jessie-non-voting/src/tests/phpunit/MediaWikiTestCase.php:400
23:11:51 /home/jenkins/workspace/mwext-testextension-hhvm-composer-jessie-non-voting/src/maintenance/doMaintenance.php:111
23:11:51
23:11:51 13) BSApiChecklistTasksTest::testTask_saveOptionsList
23:11:51 Compilation failed: two named subpatterns have the same name at offset 594
23:11:51
23:11:51 /home/jenkins/workspace/mwext-testextension-hhvm-composer-jessie-non-voting/src/includes/MagicWordArray.php:275
23:11:51 /home/jenkins/workspace/mwext-testextension-hhvm-composer-jessie-non-voting/src/includes/parser/Parser.php:3994
23:11:51 /home/jenkins/workspace/mwext-testextension-hhvm-composer-jessie-non-voting/src/includes/parser/Parser.php:1319
23:11:51 /home/jenkins/workspace/mwext-testextension-hhvm-composer-jessie-non-voting/src/includes/parser/Parser.php:451
23:11:51 /home/jenkins/workspace/mwext-testextension-hhvm-composer-jessie-non-voting/src/includes/content/WikitextContent.php:330
23:11:51 /home/jenkins/workspace/mwext-testextension-hhvm-composer-jessie-non-voting/src/includes/content/AbstractContent.php:497
23:11:51 /home/jenkins/workspace/mwext-testextension-hhvm-composer-jessie-non-voting/src/includes/page/WikiPage.php:2069
23:11:51 /home/jenkins/workspace/mwext-testextension-hhvm-composer-jessie-non-voting/src/extensions/BlueSpiceExtensions/PageAccess/PageAccess.class.php:59
23:11:51 /home/jenkins/workspace/mwext-testextension-hhvm-composer-jessie-non-voting/src/includes/Hooks.php:186
23:11:51 /home/jenkins/workspace/mwext-testextension-hhvm-composer-jessie-non-voting/src/includes/page/WikiPage.php:1568
23:11:51 /home/jenkins/workspace/mwext-testextension-hhvm-composer-jessie-non-voting/src/tests/phpunit/MediaWikiTestCase.php:970
23:11:51 /home/jenkins/workspace/mwext-testextension-hhvm-composer-jessie-non-voting/src/extensions/BlueSpiceExtensions/Checklist/tests/phpunit/BSApiChecklistTasksTest.php:29
23:11:51 /home/jenkins/workspace/mwext-testextension-hhvm-composer-jessie-non-voting/src/tests/phpunit/MediaWikiTestCase.php:400
23:11:51 /home/jenkins/workspace/mwext-testextension-hhvm-composer-jessie-non-voting/src/maintenance/doMaintenance.php:111
23:11:51
23:11:51 14) BSApiChecklistTasksTest::testApiTestGroup
23:11:51 Compilation failed: two named subpatterns have the same name at offset 594
23:11:51
23:11:51 /home/jenkins/workspace/mwext-testextension-hhvm-composer-jessie-non-voting/src/includes/MagicWordArray.php:275
23:11:51 /home/jenkins/workspace/mwext-testextension-hhvm-composer-jessie-non-voting/src/includes/parser/Parser.php:3994
23:11:51 /home/jenkins/workspace/mwext-testextension-hhvm-composer-jessie-non-voting/src/includes/parser/Parser.php:1319
23:11:51 /home/jenkins/workspace/mwext-testextension-hhvm-composer-jessie-non-voting/src/includes/parser/Parser.php:451
23:11:51 /home/jenkins/workspace/mwext-testextension-hhvm-composer-jessie-non-voting/src/includes/content/WikitextContent.php:330
23:11:51 /home/jenkins/workspace/mwext-testextension-hhvm-composer-jessie-non-voting/src/includes/content/AbstractContent.php:497
23:11:51 /home/jenkins/workspace/mwext-testextension-hhvm-composer-jessie-non-voting/src/includes/page/WikiPage.php:2069
23:11:51 /home/jenkins/workspace/mwext-testextension-hhvm-composer-jessie-non-voting/src/extensions/BlueSpiceExtensions/PageAccess/PageAccess.class.php:59
23:11:51 /home/jenkins/workspace/mwext-testextension-hhvm-composer-jessie-non-voting/src/includes/Hooks.php:186
23:11:51 /home/jenkins/workspace/mwext-testextension-hhvm-composer-jessie-non-voting/src/includes/page/WikiPage.php:1568
23:11:51 /home/jenkins/workspace/mwext-testextension-hhvm-composer-jessie-non-voting/src/tests/phpunit/MediaWikiTestCase.php:970
23:11:51 /home/jenkins/workspace/mwext-testextension-hhvm-composer-jessie-non-voting/src/extensions/BlueSpiceExtensions/Checklist/tests/phpunit/BSApiChecklistTasksTest.php:29
23:11:51 /home/jenkins/workspace/mwext-testextension-hhvm-composer-jessie-non-voting/src/tests/phpunit/MediaWikiTestCase.php:400
23:11:51 /home/jenkins/workspace/mwext-testextension-hhvm-composer-jessie-non-voting/src/maintenance/doMaintenance.php:111
23:11:51
23:11:51 15) BSApiChecklistTasksTest::testMediaWikiTestCaseParentSetupCalled
23:11:51 Compilation failed: two named subpatterns have the same name at offset 594
23:11:51
23:11:51 /home/jenkins/workspace/mwext-testextension-hhvm-composer-jessie-non-voting/src/includes/MagicWordArray.php:275
23:11:51 /home/jenkins/workspace/mwext-testextension-hhvm-composer-jessie-non-voting/src/includes/parser/Parser.php:3994
23:11:51 /home/jenkins/workspace/mwext-testextension-hhvm-composer-jessie-non-voting/src/includes/parser/Parser.php:1319
23:11:51 /home/jenkins/workspace/mwext-testextension-hhvm-composer-jessie-non-voting/src/includes/parser/Parser.php:451
23:11:51 /home/jenkins/workspace/mwext-testextension-hhvm-composer-jessie-non-voting/src/includes/content/WikitextContent.php:330
23:11:51 /home/jenkins/workspace/mwext-testextension-hhvm-composer-jessie-non-voting/src/includes/content/AbstractContent.php:497
23:11:51 /home/jenkins/workspace/mwext-testextension-hhvm-composer-jessie-non-voting/src/includes/page/WikiPage.php:2069
23:11:51 /home/jenkins/workspace/mwext-testextension-hhvm-composer-jessie-non-voting/src/extensions/BlueSpiceExtensions/PageAccess/PageAccess.class.php:59
23:11:51 /home/jenkins/workspace/mwext-testextension-hhvm-composer-jessie-non-voting/src/includes/Hooks.php:186
23:11:51 /home/jenkins/workspace/mwext-testextension-hhvm-composer-jessie-non-voting/src/includes/page/WikiPage.php:1568
23:11:51 /home/jenkins/workspace/mwext-testextension-hhvm-composer-jessie-non-voting/src/tests/phpunit/MediaWikiTestCase.php:970
23:11:51 /home/jenkins/workspace/mwext-testextension-hhvm-composer-jessie-non-voting/src/extensions/BlueSpiceExtensions/Checklist/tests/phpunit/BSApiChecklistTasksTest.php:29
23:11:51 /home/jenkins/workspace/mwext-testextension-hhvm-composer-jessie-non-voting/src/tests/phpunit/MediaWikiTestCase.php:400
23:11:51 /home/jenkins/workspace/mwext-testextension-hhvm-composer-jessie-non-voting/src/maintenance/doMaintenance.php:111
23:11:51
23:11:51 16) BSApiDashboardTasksTest::testSaveAdminDashboardConfig
23:11:51 ApiUsageException: Permission denied.
23:11:51
23:11:51 /home/jenkins/workspace/mwext-testextension-hhvm-composer-jessie-non-voting/src/includes/api/ApiUsageException.php:145
23:11:51 /home/jenkins/workspace/mwext-testextension-hhvm-composer-jessie-non-voting/src/includes/api/ApiBase.php:1779
23:11:51 /home/jenkins/workspace/mwext-testextension-hhvm-composer-jessie-non-voting/src/extensions/BlueSpiceFoundation/includes/api/BSApiTasksBase.php:137
23:11:51 /home/jenkins/workspace/mwext-testextension-hhvm-composer-jessie-non-voting/src/includes/api/ApiMain.php:1543
23:11:51 /home/jenkins/workspace/mwext-testextension-hhvm-composer-jessie-non-voting/src/includes/api/ApiMain.php:513
23:11:51 /home/jenkins/workspace/mwext-testextension-hhvm-composer-jessie-non-voting/src/tests/phpunit/includes/api/ApiTestCase.php:99
23:11:51 /home/jenkins/workspace/mwext-testextension-hhvm-composer-jessie-non-voting/src/tests/phpunit/includes/api/ApiTestCase.php:146
23:11:51 /home/jenkins/workspace/mwext-testextension-hhvm-composer-jessie-non-voting/src/extensions/BlueSpiceFoundation/tests/BSApiTasksTestBase.php:22
23:11:51 /home/jenkins/workspace/mwext-testextension-hhvm-composer-jessie-non-voting/src/extensions/BlueSpiceExtensions/Dashboards/tests/phpunit/BSApiDashboardTasksTest.php:33
23:11:51 /home/jenkins/workspace/mwext-testextension-hhvm-composer-jessie-non-voting/src/tests/phpunit/MediaWikiTestCase.php:400
23:11:51 /home/jenkins/workspace/mwext-testextension-hhvm-composer-jessie-non-voting/src/maintenance/doMaintenance.php:111
23:11:51
23:11:51 17) BSApiDashboardWidgetsTasksTest::testWikipage
23:11:51 Compilation failed: two named subpatterns have the same name at offset 594
23:11:51
23:11:51 /home/jenkins/workspace/mwext-testextension-hhvm-composer-jessie-non-voting/src/includes/MagicWordArray.php:275
23:11:51 /home/jenkins/workspace/mwext-testextension-hhvm-composer-jessie-non-voting/src/includes/parser/Parser.php:3994
23:11:51 /home/jenkins/workspace/mwext-testextension-hhvm-composer-jessie-non-voting/src/includes/parser/Parser.php:1319
23:11:51 /home/jenkins/workspace/mwext-testextension-hhvm-composer-jessie-non-voting/src/includes/parser/Parser.php:451
23:11:51 /home/jenkins/workspace/mwext-testextension-hhvm-composer-jessie-non-voting/src/includes/content/WikitextContent.php:330
23:11:51 /home/jenkins/workspace/mwext-testextension-hhvm-composer-jessie-non-voting/src/includes/content/AbstractContent.php:497
23:11:51 /home/jenkins/workspace/mwext-testextension-hhvm-composer-jessie-non-voting/src/includes/page/WikiPage.php:2069
23:11:51 /home/jenkins/workspace/mwext-testextension-hhvm-composer-jessie-non-voting/src/extensions/BlueSpiceExtensions/PageAccess/PageAccess.class.php:59
23:11:51 /home/jenkins/workspace/mwext-testextension-hhvm-composer-jessie-non-voting/src/includes/Hooks.php:186
23:11:51 /home/jenkins/workspace/mwext-testextension-hhvm-composer-jessie-non-voting/src/includes/page/WikiPage.php:1568
23:11:51 /home/jenkins/workspace/mwext-testextension-hhvm-composer-jessie-non-voting/src/tests/phpunit/MediaWikiTestCase.php:970
23:11:51 /home/jenkins/workspace/mwext-testextension-hhvm-composer-jessie-non-voting/src/extensions/BlueSpiceExtensions/Dashboards/tests/phpunit/BSApiDashboardWidgetsTasksTest.php:28
23:11:51 /home/jenkins/workspace/mwext-testextension-hhvm-composer-jessie-non-voting/src/tests/phpunit/MediaWikiTestCase.php:400
23:11:51 /home/jenkins/workspace/mwext-testextension-hhvm-composer-jessie-non-voting/src/maintenance/doMaintenance.php:111
23:11:51
23:11:51 18) BSApiDashboardWidgetsTasksTest::testApiTestGroup
23:11:51 Compilation failed: two named subpatterns have the same name at offset 594
23:11:51
23:11:51 /home/jenkins/workspace/mwext-testextension-hhvm-composer-jessie-non-voting/src/includes/MagicWordArray.php:275
23:11:51 /home/jenkins/workspace/mwext-testextension-hhvm-composer-jessie-non-voting/src/includes/parser/Parser.php:3994
23:11:51 /home/jenkins/workspace/mwext-testextension-hhvm-composer-jessie-non-voting/src/includes/parser/Parser.php:1319
23:11:51 /home/jenkins/workspace/mwext-testextension-hhvm-composer-jessie-non-voting/src/includes/parser/Parser.php:451
23:11:51 /home/jenkins/workspace/mwext-testextension-hhvm-composer-jessie-non-voting/src/includes/content/WikitextContent.php:330
23:11:51 /home/jenkins/workspace/mwext-testextension-hhvm-composer-jessie-non-voting/src/includes/content/AbstractContent.php:497
23:11:51 /home/jenkins/workspace/mwext-testextension-hhvm-composer-jessie-non-voting/src/includes/page/WikiPage.php:2069
23:11:51 /home/jenkins/workspace/mwext-testextension-hhvm-composer-jessie-non-voting/src/extensions/BlueSpiceExtensions/PageAccess/PageAccess.class.php:59
23:11:51 /home/jenkins/workspace/mwext-testextension-hhvm-composer-jessie-non-voting/src/includes/Hooks.php:186
23:11:51 /home/jenkins/workspace/mwext-testextension-hhvm-composer-jessie-non-voting/src/includes/page/WikiPage.php:1568
23:11:51 /home/jenkins/workspace/mwext-testextension-hhvm-composer-jessie-non-voting/src/tests/phpunit/MediaWikiTestCase.php:970
23:11:51 /home/jenkins/workspace/mwext-testextension-hhvm-composer-jessie-non-voting/src/extensions/BlueSpiceExtensions/Dashboards/tests/phpunit/BSApiDashboardWidgetsTasksTest.php:28
23:11:51 /home/jenkins/workspace/mwext-testextension-hhvm-composer-jessie-non-voting/src/tests/phpunit/MediaWikiTestCase.php:400
23:11:51 /home/jenkins/workspace/mwext-testextension-hhvm-composer-jessie-non-voting/src/maintenance/doMaintenance.php:111
23:11:51
23:11:51 19) BSApiDashboardWidgetsTasksTest::testMediaWikiTestCaseParentSetupCalled
23:11:51 Compilation failed: two named subpatterns have the same name at offset 594
23:11:51
23:11:51 /home/jenkins/workspace/mwext-testextension-hhvm-composer-jessie-non-voting/src/includes/MagicWordArray.php:275
23:11:51 /home/jenkins/workspace/mwext-testextension-hhvm-composer-jessie-non-voting/src/includes/parser/Parser.php:3994
23:11:51 /home/jenkins/workspace/mwext-testextension-hhvm-composer-jessie-non-voting/src/includes/parser/Parser.php:1319
23:11:51 /home/jenkins/workspace/mwext-testextension-hhvm-composer-jessie-non-voting/src/includes/parser/Parser.php:451
23:11:51 /home/jenkins/workspace/mwext-testextension-hhvm-composer-jessie-non-voting/src/includes/content/WikitextContent.php:330
23:11:51 /home/jenkins/workspace/mwext-testextension-hhvm-composer-jessie-non-voting/src/includes/content/AbstractContent.php:497
23:11:51 /home/jenkins/workspace/mwext-testextension-hhvm-composer-jessie-non-voting/src/includes/page/WikiPage.php:2069
23:11:51 /home/jenkins/workspace/mwext-testextension-hhvm-composer-jessie-non-voting/src/extensions/BlueSpiceExtensions/PageAccess/PageAccess.class.php:59
23:11:51 /home/jenkins/workspace/mwext-testextension-hhvm-composer-jessie-non-voting/src/includes/Hooks.php:186
23:11:51 /home/jenkins/workspace/mwext-testextension-hhvm-composer-jessie-non-voting/src/includes/page/WikiPage.php:1568
23:11:51 /home/jenkins/workspace/mwext-testextension-hhvm-composer-jessie-non-voting/src/tests/phpunit/MediaWikiTestCase.php:970
23:11:51 /home/jenkins/workspace/mwext-testextension-hhvm-composer-jessie-non-voting/src/extensions/BlueSpiceExtensions/Dashboards/tests/phpunit/BSApiDashboardWidgetsTasksTest.php:28
23:11:51 /home/jenkins/workspace/mwext-testextension-hhvm-composer-jessie-non-voting/src/tests/phpunit/MediaWikiTestCase.php:400
23:11:51 /home/jenkins/workspace/mwext-testextension-hhvm-composer-jessie-non-voting/src/maintenance/doMaintenance.php:111
23:11:51
23:11:51 20) BSApiTasksFormattingHelpTest::testGetFormattingHelp
23:11:51 Undefined index: getFormattingHelp
23:11:51
23:11:51 /home/jenkins/workspace/mwext-testextension-hhvm-composer-jessie-non-voting/src/extensions/BlueSpiceFoundation/includes/utility/BSTasksApiSpec.php:27
23:11:51 /home/jenkins/workspace/mwext-testextension-hhvm-composer-jessie-non-voting/src/extensions/BlueSpiceFoundation/includes/utility/BSTasksApiSpec.php:36
23:11:51 /home/jenkins/workspace/mwext-testextension-hhvm-composer-jessie-non-voting/src/extensions/BlueSpiceFoundation/includes/api/BSApiTasksBase.php:438
23:11:51 /home/jenkins/workspace/mwext-testextension-hhvm-composer-jessie-non-voting/src/extensions/BlueSpiceFoundation/includes/api/BSApiTasksBase.php:150
23:11:51 /home/jenkins/workspace/mwext-testextension-hhvm-composer-jessie-non-voting/src/includes/api/ApiMain.php:1543
23:11:51 /home/jenkins/workspace/mwext-testextension-hhvm-composer-jessie-non-voting/src/includes/api/ApiMain.php:513
23:11:51 /home/jenkins/workspace/mwext-testextension-hhvm-composer-jessie-non-voting/src/tests/phpunit/includes/api/ApiTestCase.php:99
23:11:51 /home/jenkins/workspace/mwext-testextension-hhvm-composer-jessie-non-voting/src/tests/phpunit/includes/api/ApiTestCase.php:146
23:11:51 /home/jenkins/workspace/mwext-testextension-hhvm-composer-jessie-non-voting/src/extensions/BlueSpiceFoundation/tests/BSApiTasksTestBase.php:22
23:11:51 /home/jenkins/workspace/mwext-testextension-hhvm-composer-jessie-non-voting/src/extensions/BlueSpiceExtensions/FormattingHelp/tests/phpunit/BSApiTasksFormattingHelpTest.php:11
23:11:51 /home/jenkins/workspace/mwext-testextension-hhvm-composer-jessie-non-voting/src/tests/phpunit/MediaWikiTestCase.php:400
23:11:51 /home/jenkins/workspace/mwext-testextension-hhvm-composer-jessie-non-voting/src/maintenance/doMaintenance.php:111
23:11:51
23:11:51 21) BSApiPageTemplatesStoreTest::testSchema
23:11:51 Undefined index: 0
23:11:51
23:11:51 /home/jenkins/workspace/mwext-testextension-hhvm-composer-jessie-non-voting/src/extensions/BlueSpiceFoundation/tests/BSApiExtJSStoreTestBase.php:34
23:11:51 /home/jenkins/workspace/mwext-testextension-hhvm-composer-jessie-non-voting/src/tests/phpunit/MediaWikiTestCase.php:400
23:11:51 /home/jenkins/workspace/mwext-testextension-hhvm-composer-jessie-non-voting/src/maintenance/doMaintenance.php:111
23:11:51
23:11:51 22) BSApiPageTemplatesTasksTest::testDoEditTemplate
23:11:51 ApiUsageException: Permission denied.
23:11:51
23:11:51 /home/jenkins/workspace/mwext-testextension-hhvm-composer-jessie-non-voting/src/includes/api/ApiUsageException.php:145
23:11:51 /home/jenkins/workspace/mwext-testextension-hhvm-composer-jessie-non-voting/src/includes/api/ApiBase.php:1779
23:11:51 /home/jenkins/workspace/mwext-testextension-hhvm-composer-jessie-non-voting/src/extensions/BlueSpiceFoundation/includes/api/BSApiTasksBase.php:137
23:11:51 /home/jenkins/workspace/mwext-testextension-hhvm-composer-jessie-non-voting/src/includes/api/ApiMain.php:1543
23:11:51 /home/jenkins/workspace/mwext-testextension-hhvm-composer-jessie-non-voting/src/includes/api/ApiMain.php:513
23:11:51 /home/jenkins/workspace/mwext-testextension-hhvm-composer-jessie-non-voting/src/tests/phpunit/includes/api/ApiTestCase.php:99
23:11:51 /home/jenkins/workspace/mwext-testextension-hhvm-composer-jessie-non-voting/src/tests/phpunit/includes/api/ApiTestCase.php:146
23:11:51 /home/jenkins/workspace/mwext-testextension-hhvm-composer-jessie-non-voting/src/extensions/BlueSpiceFoundation/tests/BSApiTasksTestBase.php:22
23:11:51 /home/jenkins/workspace/mwext-testextension-hhvm-composer-jessie-non-voting/src/extensions/BlueSpiceExtensions/PageTemplates/tests/phpunit/BSApiPageTemplatesTasksTest.php:26
23:11:51 /home/jenkins/workspace/mwext-testextension-hhvm-composer-jessie-non-voting/src/tests/phpunit/MediaWikiTestCase.php:400
23:11:51 /home/jenkins/workspace/mwext-testextension-hhvm-composer-jessie-non-voting/src/maintenance/doMaintenance.php:111
23:11:51
23:11:51 23) BSApiWikiPageTasksTest::testAddCategoriesSucceeds
23:11:51 Compilation failed: two named subpatterns have the same name at offset 594
23:11:51
23:11:51 /home/jenkins/workspace/mwext-testextension-hhvm-composer-jessie-non-voting/src/includes/MagicWordArray.php:275
23:11:51 /home/jenkins/workspace/mwext-testextension-hhvm-composer-jessie-non-voting/src/includes/parser/Parser.php:3994
23:11:51 /home/jenkins/workspace/mwext-testextension-hhvm-composer-jessie-non-voting/src/includes/parser/Parser.php:1319
23:11:51 /home/jenkins/workspace/mwext-testextension-hhvm-composer-jessie-non-voting/src/includes/parser/Parser.php:451
23:11:51 /home/jenkins/workspace/mwext-testextension-hhvm-composer-jessie-non-voting/src/includes/content/WikitextContent.php:330
23:11:51 /home/jenkins/workspace/mwext-testextension-hhvm-composer-jessie-non-voting/src/includes/content/AbstractContent.php:497
23:11:51 /home/jenkins/workspace/mwext-testextension-hhvm-composer-jessie-non-voting/src/includes/page/WikiPage.php:2069
23:11:51 /home/jenkins/workspace/mwext-testextension-hhvm-composer-jessie-non-voting/src/extensions/BlueSpiceExtensions/PageAccess/PageAccess.class.php:59
23:11:51 /home/jenkins/workspace/mwext-testextension-hhvm-composer-jessie-non-voting/src/includes/Hooks.php:186
23:11:51 /home/jenkins/workspace/mwext-testextension-hhvm-composer-jessie-non-voting/src/includes/page/WikiPage.php:1568
23:11:51 /home/jenkins/workspace/mwext-testextension-hhvm-composer-jessie-non-voting/src/tests/phpunit/MediaWikiTestCase.php:970
23:11:51 /home/jenkins/workspace/mwext-testextension-hhvm-composer-jessie-non-voting/src/extensions/BlueSpiceFoundation/tests/api/BSApiWikiPageTasksTest.php:20
23:11:51 /home/jenkins/workspace/mwext-testextension-hhvm-composer-jessie-non-voting/src/tests/phpunit/MediaWikiTestCase.php:400
23:11:51 /home/jenkins/workspace/mwext-testextension-hhvm-composer-jessie-non-voting/src/maintenance/doMaintenance.php:111
23:11:51
23:11:51 24) BSApiWikiPageTasksTest::testSetCategoriesSucceeds
23:11:51 Compilation failed: two named subpatterns have the same name at offset 594
23:11:51
23:11:51 /home/jenkins/workspace/mwext-testextension-hhvm-composer-jessie-non-voting/src/includes/MagicWordArray.php:275
23:11:51 /home/jenkins/workspace/mwext-testextension-hhvm-composer-jessie-non-voting/src/includes/parser/Parser.php:3994
23:11:51 /home/jenkins/workspace/mwext-testextension-hhvm-composer-jessie-non-voting/src/includes/parser/Parser.php:1319
23:11:51 /home/jenkins/workspace/mwext-testextension-hhvm-composer-jessie-non-voting/src/includes/parser/Parser.php:451
23:11:51 /home/jenkins/workspace/mwext-testextension-hhvm-composer-jessie-non-voting/src/includes/content/WikitextContent.php:330
23:11:51 /home/jenkins/workspace/mwext-testextension-hhvm-composer-jessie-non-voting/src/includes/content/AbstractContent.php:497
23:11:51 /home/jenkins/workspace/mwext-testextension-hhvm-composer-jessie-non-voting/src/includes/page/WikiPage.php:2069
23:11:51 /home/jenkins/workspace/mwext-testextension-hhvm-composer-jessie-non-voting/src/extensions/BlueSpiceExtensions/PageAccess/PageAccess.class.php:59
23:11:51 /home/jenkins/workspace/mwext-testextension-hhvm-composer-jessie-non-voting/src/includes/Hooks.php:186
23:11:51 /home/jenkins/workspace/mwext-testextension-hhvm-composer-jessie-non-voting/src/includes/page/WikiPage.php:1568
23:11:51 /home/jenkins/workspace/mwext-testextension-hhvm-composer-jessie-non-voting/src/tests/phpunit/MediaWikiTestCase.php:970
23:11:51 /home/jenkins/workspace/mwext-testextension-hhvm-composer-jessie-non-voting/src/extensions/BlueSpiceFoundation/tests/api/BSApiWikiPageTasksTest.php:20
23:11:51 /home/jenkins/workspace/mwext-testextension-hhvm-composer-jessie-non-voting/src/tests/phpunit/MediaWikiTestCase.php:400
23:11:51 /home/jenkins/workspace/mwext-testextension-hhvm-composer-jessie-non-voting/src/maintenance/doMaintenance.php:111
23:11:51
23:11:51 25) BSApiWikiPageTasksTest::testRemoveCategoriesSucceeds
23:11:51 Compilation failed: two named subpatterns have the same name at offset 594
23:11:51
23:11:51 /home/jenkins/workspace/mwext-testextension-hhvm-composer-jessie-non-voting/src/includes/MagicWordArray.php:275
23:11:51 /home/jenkins/workspace/mwext-testextension-hhvm-composer-jessie-non-voting/src/includes/parser/Parser.php:3994
23:11:51 /home/jenkins/workspace/mwext-testextension-hhvm-composer-jessie-non-voting/src/includes/parser/Parser.php:1319
23:11:51 /home/jenkins/workspace/mwext-testextension-hhvm-composer-jessie-non-voting/src/includes/parser/Parser.php:451
23:11:51 /home/jenkins/workspace/mwext-testextension-hhvm-composer-jessie-non-voting/src/includes/content/WikitextContent.php:330
23:11:51 /home/jenkins/workspace/mwext-testextension-hhvm-composer-jessie-non-voting/src/includes/content/AbstractContent.php:497
23:11:51 /home/jenkins/workspace/mwext-testextension-hhvm-composer-jessie-non-voting/src/includes/page/WikiPage.php:2069
23:11:51 /home/jenkins/workspace/mwext-testextension-hhvm-composer-jessie-non-voting/src/extensions/BlueSpiceExtensions/PageAccess/PageAccess.class.php:59
23:11:51 /home/jenkins/workspace/mwext-testextension-hhvm-composer-jessie-non-voting/src/includes/Hooks.php:186
23:11:51 /home/jenkins/workspace/mwext-testextension-hhvm-composer-jessie-non-voting/src/includes/page/WikiPage.php:1568
23:11:51 /home/jenkins/workspace/mwext-testextension-hhvm-composer-jessie-non-voting/src/tests/phpunit/MediaWikiTestCase.php:970
23:11:51 /home/jenkins/workspace/mwext-testextension-hhvm-composer-jessie-non-voting/src/extensions/BlueSpiceFoundation/tests/api/BSApiWikiPageTasksTest.php:20
23:11:51 /home/jenkins/workspace/mwext-testextension-hhvm-composer-jessie-non-voting/src/tests/phpunit/MediaWikiTestCase.php:400
23:11:51 /home/jenkins/workspace/mwext-testextension-hhvm-composer-jessie-non-voting/src/maintenance/doMaintenance.php:111
23:11:51
23:11:51 26) BSApiWikiPageTasksTest::testApiTestGroup
23:11:51 Compilation failed: two named subpatterns have the same name at offset 594
23:11:51
23:11:51 /home/jenkins/workspace/mwext-testextension-hhvm-composer-jessie-non-voting/src/includes/MagicWordArray.php:275
23:11:51 /home/jenkins/workspace/mwext-testextension-hhvm-composer-jessie-non-voting/src/includes/parser/Parser.php:3994
23:11:51 /home/jenkins/workspace/mwext-testextension-hhvm-composer-jessie-non-voting/src/includes/parser/Parser.php:1319
23:11:51 /home/jenkins/workspace/mwext-testextension-hhvm-composer-jessie-non-voting/src/includes/parser/Parser.php:451
23:11:51 /home/jenkins/workspace/mwext-testextension-hhvm-composer-jessie-non-voting/src/includes/content/WikitextContent.php:330
23:11:51 /home/jenkins/workspace/mwext-testextension-hhvm-composer-jessie-non-voting/src/includes/content/AbstractContent.php:497
23:11:51 /home/jenkins/workspace/mwext-testextension-hhvm-composer-jessie-non-voting/src/includes/page/WikiPage.php:2069
23:11:51 /home/jenkins/workspace/mwext-testextension-hhvm-composer-jessie-non-voting/src/extensions/BlueSpiceExtensions/PageAccess/PageAccess.class.php:59
23:11:51 /home/jenkins/workspace/mwext-testextension-hhvm-composer-jessie-non-voting/src/includes/Hooks.php:186
23:11:51 /home/jenkins/workspace/mwext-testextension-hhvm-composer-jessie-non-voting/src/includes/page/WikiPage.php:1568
23:11:51 /home/jenkins/workspace/mwext-testextension-hhvm-composer-jessie-non-voting/src/tests/phpunit/MediaWikiTestCase.php:970
23:11:51 /home/jenkins/workspace/mwext-testextension-hhvm-composer-jessie-non-voting/src/extensions/BlueSpiceFoundation/tests/api/BSApiWikiPageTasksTest.php:20
23:11:51 /home/jenkins/workspace/mwext-testextension-hhvm-composer-jessie-non-voting/src/tests/phpunit/MediaWikiTestCase.php:400
23:11:51 /home/jenkins/workspace/mwext-testextension-hhvm-composer-jessie-non-voting/src/maintenance/doMaintenance.php:111
23:11:51
23:11:51 27) BSApiWikiPageTasksTest::testMediaWikiTestCaseParentSetupCalled
23:11:51 Compilation failed: two named subpatterns have the same name at offset 594
23:11:51
23:11:51 /home/jenkins/workspace/mwext-testextension-hhvm-composer-jessie-non-voting/src/includes/MagicWordArray.php:275
23:11:51 /home/jenkins/workspace/mwext-testextension-hhvm-composer-jessie-non-voting/src/includes/parser/Parser.php:3994
23:11:51 /home/jenkins/workspace/mwext-testextension-hhvm-composer-jessie-non-voting/src/includes/parser/Parser.php:1319
23:11:51 /home/jenkins/workspace/mwext-testextension-hhvm-composer-jessie-non-voting/src/includes/parser/Parser.php:451
23:11:51 /home/jenkins/workspace/mwext-testextension-hhvm-composer-jessie-non-voting/src/includes/content/WikitextContent.php:330
23:11:51 /home/jenkins/workspace/mwext-testextension-hhvm-composer-jessie-non-voting/src/includes/content/AbstractContent.php:497
23:11:51 /home/jenkins/workspace/mwext-testextension-hhvm-composer-jessie-non-voting/src/includes/page/WikiPage.php:2069
23:11:51 /home/jenkins/workspace/mwext-testextension-hhvm-composer-jessie-non-voting/src/extensions/BlueSpiceExtensions/PageAccess/PageAccess.class.php:59
23:11:51 /home/jenkins/workspace/mwext-testextension-hhvm-composer-jessie-non-voting/src/includes/Hooks.php:186
23:11:51 /home/jenkins/workspace/mwext-testextension-hhvm-composer-jessie-non-voting/src/includes/page/WikiPage.php:1568
23:11:51 /home/jenkins/workspace/mwext-testextension-hhvm-composer-jessie-non-voting/src/tests/phpunit/MediaWikiTestCase.php:970
23:11:51 /home/jenkins/workspace/mwext-testextension-hhvm-composer-jessie-non-voting/src/extensions/BlueSpiceFoundation/tests/api/BSApiWikiPageTasksTest.php:20
23:11:51 /home/jenkins/workspace/mwext-testextension-hhvm-composer-jessie-non-voting/src/tests/phpunit/MediaWikiTestCase.php:400
23:11:51 /home/jenkins/workspace/mwext-testextension-hhvm-composer-jessie-non-voting/src/maintenance/doMaintenance.php:111
23:11:51
23:11:51 --
23:11:51
23:11:51 There were 50 failures:
23:11:51
23:11:51 1) ApiDocumentationTest::testDocumentationExists with data set "Module bs-contextmenu-tasks with MiserMode=false, AllowCategorizedRecentChanges=false" ('bs-contextmenu-tasks', array(false, false))
23:11:51 Module description message apihelp-bs-contextmenu-tasks-description exists
23:11:51 Failed asserting that false is true.
23:11:51
23:11:51 /home/jenkins/workspace/mwext-testextension-hhvm-composer-jessie-non-voting/src/tests/phpunit/structure/ApiDocumentationTest.php:51
23:11:51 /home/jenkins/workspace/mwext-testextension-hhvm-composer-jessie-non-voting/src/tests/phpunit/structure/ApiDocumentationTest.php:80
23:11:51 /home/jenkins/workspace/mwext-testextension-hhvm-composer-jessie-non-voting/src/tests/phpunit/MediaWikiTestCase.php:400
23:11:51 /home/jenkins/workspace/mwext-testextension-hhvm-composer-jessie-non-voting/src/maintenance/doMaintenance.php:111
23:11:51
23:11:51 2) ApiDocumentationTest::testDocumentationExists with data set "Module bs-contextmenu-tasks with MiserMode=true, AllowCategorizedRecentChanges=true" ('bs-contextmenu-tasks', array(true, true))
23:11:51 Module description message apihelp-bs-contextmenu-tasks-description exists
23:11:51 Failed asserting that false is true.
23:11:51
23:11:51 /home/jenkins/workspace/mwext-testextension-hhvm-composer-jessie-non-voting/src/tests/phpunit/structure/ApiDocumentationTest.php:51
23:11:51 /home/jenkins/workspace/mwext-testextension-hhvm-composer-jessie-non-voting/src/tests/phpunit/structure/ApiDocumentationTest.php:80
23:11:51 /home/jenkins/workspace/mwext-testextension-hhvm-composer-jessie-non-voting/src/tests/phpunit/MediaWikiTestCase.php:400
23:11:51 /home/jenkins/workspace/mwext-testextension-hhvm-composer-jessie-non-voting/src/maintenance/doMaintenance.php:111
23:11:51
23:11:51 3) ApiDocumentationTest::testDocumentationExists with data set "Module bs-formattinghelp with MiserMode=false, AllowCategorizedRecentChanges=false" ('bs-formattinghelp', array(false, false))
23:11:51 Parameter token description message apihelp-bs-formattinghelp-param-token exists
23:11:51 Failed asserting that false is true.
23:11:51
23:11:51 /home/jenkins/workspace/mwext-testextension-hhvm-composer-jessie-non-voting/src/tests/phpunit/structure/ApiDocumentationTest.php:51
23:11:51 /home/jenkins/workspace/mwext-testextension-hhvm-composer-jessie-non-voting/src/tests/phpunit/structure/ApiDocumentationTest.php:96
23:11:51 /home/jenkins/workspace/mwext-testextension-hhvm-composer-jessie-non-voting/src/tests/phpunit/MediaWikiTestCase.php:400
23:11:51 /home/jenkins/workspace/mwext-testextension-hhvm-composer-jessie-non-voting/src/maintenance/doMaintenance.php:111
23:11:51
23:11:51 4) ApiDocumentationTest::testDocumentationExists with data set "Module bs-formattinghelp with MiserMode=true, AllowCategorizedRecentChanges=true" ('bs-formattinghelp', array(true, true))
23:11:51 Parameter token description message apihelp-bs-formattinghelp-param-token exists
23:11:51 Failed asserting that false is true.
23:11:51
23:11:51 /home/jenkins/workspace/mwext-testextension-hhvm-composer-jessie-non-voting/src/tests/phpunit/structure/ApiDocumentationTest.php:51
23:11:51 /home/jenkins/workspace/mwext-testextension-hhvm-composer-jessie-non-voting/src/tests/phpunit/structure/ApiDocumentationTest.php:96
23:11:51 /home/jenkins/workspace/mwext-testextension-hhvm-composer-jessie-non-voting/src/tests/phpunit/MediaWikiTestCase.php:400
23:11:51 /home/jenkins/workspace/mwext-testextension-hhvm-composer-jessie-non-voting/src/maintenance/doMaintenance.php:111
23:11:52
23:11:52 5) BSApiTasksGroupManagerTest::testAddGroup
23:11:52 Failed asserting that false is true.
23:11:52
23:11:52 /home/jenkins/workspace/mwext-testextension-hhvm-composer-jessie-non-voting/src/extensions/BlueSpiceExtensions/GroupManager/tests/phpunit/BSApiTasksGroupManagerTest.php:24
23:11:52 /home/jenkins/workspace/mwext-testextension-hhvm-composer-jessie-non-voting/src/tests/phpunit/MediaWikiTestCase.php:400
23:11:52 /home/jenkins/workspace/mwext-testextension-hhvm-composer-jessie-non-voting/src/maintenance/doMaintenance.php:111
23:11:52
23:11:52 6) BSApiTasksGroupManagerTest::testEditGroup
23:11:52 Failed asserting that false matches expected true.
23:11:52
23:11:52 /home/jenkins/workspace/mwext-testextension-hhvm-composer-jessie-non-voting/src/extensions/BlueSpiceExtensions/GroupManager/tests/phpunit/BSApiTasksGroupManagerTest.php:42
23:11:52 /home/jenkins/workspace/mwext-testextension-hhvm-composer-jessie-non-voting/src/tests/phpunit/MediaWikiTestCase.php:400
23:11:52 /home/jenkins/workspace/mwext-testextension-hhvm-composer-jessie-non-voting/src/maintenance/doMaintenance.php:111
23:11:52
23:11:52 7) BSApiTasksGroupManagerTest::testRemoveGroup
23:11:52 Failed asserting that false matches expected true.
23:11:52
23:11:52 /home/jenkins/workspace/mwext-testextension-hhvm-composer-jessie-non-voting/src/extensions/BlueSpiceExtensions/GroupManager/tests/phpunit/BSApiTasksGroupManagerTest.php:57
23:11:52 /home/jenkins/workspace/mwext-testextension-hhvm-composer-jessie-non-voting/src/tests/phpunit/MediaWikiTestCase.php:400
23:11:52 /home/jenkins/workspace/mwext-testextension-hhvm-composer-jessie-non-voting/src/maintenance/doMaintenance.php:111
23:11:52
23:11:52 8) BSApiTasksGroupManagerTest::testRemoveGroups
23:11:52 Failed asserting that null is false.
23:11:52
23:11:52 /home/jenkins/workspace/mwext-testextension-hhvm-composer-jessie-non-voting/src/extensions/BlueSpiceExtensions/GroupManager/tests/phpunit/BSApiTasksGroupManagerTest.php:72
23:11:52 /home/jenkins/workspace/mwext-testextension-hhvm-composer-jessie-non-voting/src/tests/phpunit/MediaWikiTestCase.php:400
23:11:52 /home/jenkins/workspace/mwext-testextension-hhvm-composer-jessie-non-voting/src/maintenance/doMaintenance.php:111
23:11:52
23:11:52 9) BSApiTasksInterWikiLinksManagerTest::testRemoveInterWikiLink
23:11:52 Failed asserting that true is false.
23:11:52
23:11:52 /home/jenkins/workspace/mwext-testextension-hhvm-composer-jessie-non-voting/src/extensions/BlueSpiceExtensions/InterWikiLinks/tests/phpunit/BSApiTasksInterWikiLinksManagerTest.php:51
23:11:52 /home/jenkins/workspace/mwext-testextension-hhvm-composer-jessie-non-voting/src/tests/phpunit/MediaWikiTestCase.php:400
23:11:52 /home/jenkins/workspace/mwext-testextension-hhvm-composer-jessie-non-voting/src/maintenance/doMaintenance.php:111
23:11:52
23:11:52 10) BSApiNamespaceStoreTest::testPaging with data set #0 (2, 0)
23:11:52 Field "total" contains wrong value
23:11:52 Failed asserting that 18 matches expected 21.
23:11:52
23:11:52 /home/jenkins/workspace/mwext-testextension-hhvm-composer-jessie-non-voting/src/extensions/BlueSpiceFoundation/tests/BSApiExtJSStoreTestBase.php:85
23:11:52 /home/jenkins/workspace/mwext-testextension-hhvm-composer-jessie-non-voting/src/tests/phpunit/MediaWikiTestCase.php:400
23:11:52 /home/jenkins/workspace/mwext-testextension-hhvm-composer-jessie-non-voting/src/maintenance/doMaintenance.php:111
23:11:52
23:11:52 11) BSApiNamespaceStoreTest::testPaging with data set #1 (2, 2)
23:11:52 Field "total" contains wrong value
23:11:52 Failed asserting that 18 matches expected 21.
23:11:52
23:11:52 /home/jenkins/workspace/mwext-testextension-hhvm-composer-jessie-non-voting/src/extensions/BlueSpiceFoundation/tests/BSApiExtJSStoreTestBase.php:85
23:11:52 /home/jenkins/workspace/mwext-testextension-hhvm-composer-jessie-non-voting/src/tests/phpunit/MediaWikiTestCase.php:400
23:11:52 /home/jenkins/workspace/mwext-testextension-hhvm-composer-jessie-non-voting/src/maintenance/doMaintenance.php:111
23:11:52
23:11:52 12) BSApiNamespaceStoreTest::testPaging with data set #2 (2, 4)
23:11:52 Field "total" contains wrong value
23:11:52 Failed asserting that 18 matches expected 21.
23:11:52
23:11:52 /home/jenkins/workspace/mwext-testextension-hhvm-composer-jessie-non-voting/src/extensions/BlueSpiceFoundation/tests/BSApiExtJSStoreTestBase.php:85
23:11:52 /home/jenkins/workspace/mwext-testextension-hhvm-composer-jessie-non-voting/src/tests/phpunit/MediaWikiTestCase.php:400
23:11:52 /home/jenkins/workspace/mwext-testextension-hhvm-composer-jessie-non-voting/src/maintenance/doMaintenance.php:111
23:11:52
23:11:52 13) BSApiNamespaceStoreTest::testPaging with data set #3 (4, 0)
23:11:52 Field "total" contains wrong value
23:11:52 Failed asserting that 18 matches expected 21.
23:11:52
23:11:52 /home/jenkins/workspace/mwext-testextension-hhvm-composer-jessie-non-voting/src/extensions/BlueSpiceFoundation/tests/BSApiExtJSStoreTestBase.php:85
23:11:52 /home/jenkins/workspace/mwext-testextension-hhvm-composer-jessie-non-voting/src/tests/phpunit/MediaWikiTestCase.php:400
23:11:52 /home/jenkins/workspace/mwext-testextension-hhvm-composer-jessie-non-voting/src/maintenance/doMaintenance.php:111
23:11:52
23:11:52 14) BSApiNamespaceStoreTest::testPaging with data set #4 (4, 4)
23:11:52 Field "total" contains wrong value
23:11:52 Failed asserting that 18 matches expected 21.
23:11:52
23:11:52 /home/jenkins/workspace/mwext-testextension-hhvm-composer-jessie-non-voting/src/extensions/BlueSpiceFoundation/tests/BSApiExtJSStoreTestBase.php:85
23:11:52 /home/jenkins/workspace/mwext-testextension-hhvm-composer-jessie-non-voting/src/tests/phpunit/MediaWikiTestCase.php:400
23:11:52 /home/jenkins/workspace/mwext-testextension-hhvm-composer-jessie-non-voting/src/maintenance/doMaintenance.php:111
23:11:52
23:11:52 15) BSApiNamespaceStoreTest::testPaging with data set #5 (4, 8)
23:11:52 Field "total" contains wrong value
23:11:52 Failed asserting that 18 matches expected 21.
23:11:52
23:11:52 /home/jenkins/workspace/mwext-testextension-hhvm-composer-jessie-non-voting/src/extensions/BlueSpiceFoundation/tests/BSApiExtJSStoreTestBase.php:85
23:11:52 /home/jenkins/workspace/mwext-testextension-hhvm-composer-jessie-non-voting/src/tests/phpunit/MediaWikiTestCase.php:400
23:11:52 /home/jenkins/workspace/mwext-testextension-hhvm-composer-jessie-non-voting/src/maintenance/doMaintenance.php:111
23:11:52
23:11:52 16) BSApiNamespaceStoreTest::testSingleFilter with data set "Filter by isSystemNS" ('boolean', 'eq', 'isSystemNS', false, 3)
23:11:52 Field "total" contains wrong value
23:11:52 Failed asserting that 0 matches expected 3.
23:11:52
23:11:52 /home/jenkins/workspace/mwext-testextension-hhvm-composer-jessie-non-voting/src/extensions/BlueSpiceFoundation/tests/BSApiExtJSStoreTestBase.php:139
23:11:52 /home/jenkins/workspace/mwext-testextension-hhvm-composer-jessie-non-voting/src/tests/phpunit/MediaWikiTestCase.php:400
23:11:52 /home/jenkins/workspace/mwext-testextension-hhvm-composer-jessie-non-voting/src/maintenance/doMaintenance.php:111
23:11:52
23:11:52 17) BSApiNamespaceStoreTest::testMultipleFilter with data set "Filter by subpages and searched" (array(array('boolean', 'eq', 'subpages', true), array('boolean', 'eq', 'searched', true)), 2)
23:11:52 Field "total" contains wrong value
23:11:52 Failed asserting that 0 matches expected 2.
23:11:52
23:11:52 /home/jenkins/workspace/mwext-testextension-hhvm-composer-jessie-non-voting/src/extensions/BlueSpiceFoundation/tests/BSApiExtJSStoreTestBase.php:163
23:11:52 /home/jenkins/workspace/mwext-testextension-hhvm-composer-jessie-non-voting/src/tests/phpunit/MediaWikiTestCase.php:400
23:11:52 /home/jenkins/workspace/mwext-testextension-hhvm-composer-jessie-non-voting/src/maintenance/doMaintenance.php:111
23:11:52
23:11:52 18) BSApiNamespaceTasksTest::testAdd
23:11:52 Failed asserting that false is true.
23:11:52
23:11:52 /home/jenkins/workspace/mwext-testextension-hhvm-composer-jessie-non-voting/src/extensions/BlueSpiceExtensions/NamespaceManager/tests/phpunit/BSApiNamespaceTasksTest.php:37
23:11:52 /home/jenkins/workspace/mwext-testextension-hhvm-composer-jessie-non-voting/src/tests/phpunit/MediaWikiTestCase.php:400
23:11:52 /home/jenkins/workspace/mwext-testextension-hhvm-composer-jessie-non-voting/src/maintenance/doMaintenance.php:111
23:11:52
23:11:52 19) BSApiNamespaceTasksTest::testEdit
23:11:52 Failed asserting that false is true.
23:11:52
23:11:52 /home/jenkins/workspace/mwext-testextension-hhvm-composer-jessie-non-voting/src/extensions/BlueSpiceExtensions/NamespaceManager/tests/phpunit/BSApiNamespaceTasksTest.php:63
23:11:52 /home/jenkins/workspace/mwext-testextension-hhvm-composer-jessie-non-voting/src/tests/phpunit/MediaWikiTestCase.php:400
23:11:52 /home/jenkins/workspace/mwext-testextension-hhvm-composer-jessie-non-voting/src/maintenance/doMaintenance.php:111
23:11:52
23:11:52 20) BSApiNamespaceTasksTest::testRemove
23:11:52 Failed asserting that false is true.
23:11:52
23:11:52 /home/jenkins/workspace/mwext-testextension-hhvm-composer-jessie-non-voting/src/extensions/BlueSpiceExtensions/NamespaceManager/tests/phpunit/BSApiNamespaceTasksTest.php:80
23:11:52 /home/jenkins/workspace/mwext-testextension-hhvm-composer-jessie-non-voting/src/tests/phpunit/MediaWikiTestCase.php:400
23:11:52 /home/jenkins/workspace/mwext-testextension-hhvm-composer-jessie-non-voting/src/maintenance/doMaintenance.php:111
23:11:52
23:11:52 21) BSApiChangeableGroupStoreTest::testPaging with data set #0 (2, 0)
23:11:52 Field "total" contains wrong value
23:11:52 Failed asserting that 0 matches expected 6.
23:11:52
23:11:52 /home/jenkins/workspace/mwext-testextension-hhvm-composer-jessie-non-voting/src/extensions/BlueSpiceFoundation/tests/BSApiExtJSStoreTestBase.php:85
23:11:52 /home/jenkins/workspace/mwext-testextension-hhvm-composer-jessie-non-voting/src/tests/phpunit/MediaWikiTestCase.php:400
23:11:52 /home/jenkins/workspace/mwext-testextension-hhvm-composer-jessie-non-voting/src/maintenance/doMaintenance.php:111
23:11:52
23:11:52 22) BSApiChangeableGroupStoreTest::testPaging with data set #1 (2, 2)
23:11:52 Field "total" contains wrong value
23:11:52 Failed asserting that 0 matches expected 6.
23:11:52
23:11:52 /home/jenkins/workspace/mwext-testextension-hhvm-composer-jessie-non-voting/src/extensions/BlueSpiceFoundation/tests/BSApiExtJSStoreTestBase.php:85
23:11:52 /home/jenkins/workspace/mwext-testextension-hhvm-composer-jessie-non-voting/src/tests/phpunit/MediaWikiTestCase.php:400
23:11:52 /home/jenkins/workspace/mwext-testextension-hhvm-composer-jessie-non-voting/src/maintenance/doMaintenance.php:111
23:11:52
23:11:52 23) BSApiChangeableGroupStoreTest::testPaging with data set #2 (2, 4)
23:11:52 Field "total" contains wrong value
23:11:52 Failed asserting that 0 matches expected 6.
23:11:52
23:11:52 /home/jenkins/workspace/mwext-testextension-hhvm-composer-jessie-non-voting/src/extensions/BlueSpiceFoundation/tests/BSApiExtJSStoreTestBase.php:85
23:11:52 /home/jenkins/workspace/mwext-testextension-hhvm-composer-jessie-non-voting/src/tests/phpunit/MediaWikiTestCase.php:400
23:11:52 /home/jenkins/workspace/mwext-testextension-hhvm-composer-jessie-non-voting/src/maintenance/doMaintenance.php:111
23:11:52
23:11:52 24) BSApiChangeableGroupStoreTest::testPaging with data set #3 (4, 0)
23:11:52 Field "total" contains wrong value
23:11:52 Failed asserting that 0 matches expected 6.
23:11:52
23:11:52 /home/jenkins/workspace/mwext-testextension-hhvm-composer-jessie-non-voting/src/extensions/BlueSpiceFoundation/tests/BSApiExtJSStoreTestBase.php:85
23:11:52 /home/jenkins/workspace/mwext-testextension-hhvm-composer-jessie-non-voting/src/tests/phpunit/MediaWikiTestCase.php:400
23:11:52 /home/jenkins/workspace/mwext-testextension-hhvm-composer-jessie-non-voting/src/maintenance/doMaintenance.php:111
23:11:52
23:11:52 25) BSApiChangeableGroupStoreTest::testPaging with data set #4 (4, 4)
23:11:52 Field "total" contains wrong value
23:11:52 Failed asserting that 0 matches expected 6.
23:11:52
23:11:52 /home/jenkins/workspace/mwext-testextension-hhvm-composer-jessie-non-voting/src/extensions/BlueSpiceFoundation/tests/BSApiExtJSStoreTestBase.php:85
23:11:52 /home/jenkins/workspace/mwext-testextension-hhvm-composer-jessie-non-voting/src/tests/phpunit/MediaWikiTestCase.php:400
23:11:52 /home/jenkins/workspace/mwext-testextension-hhvm-composer-jessie-non-voting/src/maintenance/doMaintenance.php:111
23:11:52
23:11:52 26) BSApiChangeableGroupStoreTest::testPaging with data set #5 (4, 8)
23:11:52 Field "total" contains wrong value
23:11:52 Failed asserting that 0 matches expected 6.
23:11:52
23:11:52 /home/jenkins/workspace/mwext-testextension-hhvm-composer-jessie-non-voting/src/extensions/BlueSpiceFoundation/tests/BSApiExtJSStoreTestBase.php:85
23:11:52 /home/jenkins/workspace/mwext-testextension-hhvm-composer-jessie-non-voting/src/tests/phpunit/MediaWikiTestCase.php:400
23:11:52 /home/jenkins/workspace/mwext-testextension-hhvm-composer-jessie-non-voting/src/maintenance/doMaintenance.php:111
23:11:52
23:11:52 27) BSApiChangeableGroupStoreTest::testSingleFilter with data set "Filter by group_name" ('string', 'ct', 'group_name', 'auto', 1)
23:11:52 Field "total" contains wrong value
23:11:52 Failed asserting that 0 matches expected 1.
23:11:52
23:11:52 /home/jenkins/workspace/mwext-testextension-hhvm-composer-jessie-non-voting/src/extensions/BlueSpiceFoundation/tests/BSApiExtJSStoreTestBase.php:139
23:11:52 /home/jenkins/workspace/mwext-testextension-hhvm-composer-jessie-non-voting/src/tests/phpunit/MediaWikiTestCase.php:400
23:11:52 /home/jenkins/workspace/mwext-testextension-hhvm-composer-jessie-non-voting/src/maintenance/doMaintenance.php:111
23:11:52
23:11:52 28) BSApiChangeableGroupStoreTest::testSingleFilter with data set "Filter by additional_group" ('boolean', 'eq', 'additional_group', false, 6)
23:11:52 Field "total" contains wrong value
23:11:52 Failed asserting that 0 matches expected 6.
23:11:52
23:11:52 /home/jenkins/workspace/mwext-testextension-hhvm-composer-jessie-non-voting/src/extensions/BlueSpiceFoundation/tests/BSApiExtJSStoreTestBase.php:139
23:11:52 /home/jenkins/workspace/mwext-testextension-hhvm-composer-jessie-non-voting/src/tests/phpunit/MediaWikiTestCase.php:400
23:11:52 /home/jenkins/workspace/mwext-testextension-hhvm-composer-jessie-non-voting/src/maintenance/doMaintenance.php:111
23:11:52
23:11:52 29) BSApiChangeableGroupStoreTest::testMultipleFilter with data set "Filter by group_name and displayname" (array(array('string', 'eq', 'group_name', 'bureaucrat'), array('string', 'ct', 'displayname', 'Bur')), 1)
23:11:52 Field "total" contains wrong value
23:11:52 Failed asserting that 0 matches expected 1.
23:11:52
23:11:52 /home/jenkins/workspace/mwext-testextension-hhvm-composer-jessie-non-voting/src/extensions/BlueSpiceFoundation/tests/BSApiExtJSStoreTestBase.php:163
23:11:52 /home/jenkins/workspace/mwext-testextension-hhvm-composer-jessie-non-voting/src/tests/phpunit/MediaWikiTestCase.php:400
23:11:52 /home/jenkins/workspace/mwext-testextension-hhvm-composer-jessie-non-voting/src/maintenance/doMaintenance.php:111
23:11:52
23:11:52 30) BSApiDashboardStoreTest::testMakeData
23:11:52 Failed asserting that 25 matches expected 39.
23:11:52
23:11:52 /home/jenkins/workspace/mwext-testextension-hhvm-composer-jessie-non-voting/src/extensions/BlueSpiceExtensions/Dashboards/tests/phpunit/BSApiDashboardStoreTest.php:43
23:11:52 /home/jenkins/workspace/mwext-testextension-hhvm-composer-jessie-non-voting/src/tests/phpunit/MediaWikiTestCase.php:400
23:11:52 /home/jenkins/workspace/mwext-testextension-hhvm-composer-jessie-non-voting/src/maintenance/doMaintenance.php:111
23:11:52
23:11:52 31) BSApiInsertMagicDataStoreTest::testPaging with data set #0 (2, 0)
23:11:52 Field "total" contains wrong value
23:11:52 Failed asserting that 91 matches expected 72.
23:11:52
23:11:52 /home/jenkins/workspace/mwext-testextension-hhvm-composer-jessie-non-voting/src/extensions/BlueSpiceFoundation/tests/BSApiExtJSStoreTestBase.php:85
23:11:52 /home/jenkins/workspace/mwext-testextension-hhvm-composer-jessie-non-voting/src/tests/phpunit/MediaWikiTestCase.php:400
23:11:52 /home/jenkins/workspace/mwext-testextension-hhvm-composer-jessie-non-voting/src/maintenance/doMaintenance.php:111
23:11:52
23:11:52 32) BSApiInsertMagicDataStoreTest::testPaging with data set #1 (2, 2)
23:11:52 Field "total" contains wrong value
23:11:52 Failed asserting that 91 matches expected 72.
23:11:52
23:11:52 /home/jenkins/workspace/mwext-testextension-hhvm-composer-jessie-non-voting/src/extensions/BlueSpiceFoundation/tests/BSApiExtJSStoreTestBase.php:85
23:11:52 /home/jenkins/workspace/mwext-testextension-hhvm-composer-jessie-non-voting/src/tests/phpunit/MediaWikiTestCase.php:400
23:11:52 /home/jenkins/workspace/mwext-testextension-hhvm-composer-jessie-non-voting/src/maintenance/doMaintenance.php:111
23:11:52
23:11:52 33) BSApiInsertMagicDataStoreTest::testPaging with data set #2 (2, 4)
23:11:52 Field "total" contains wrong value
23:11:52 Failed asserting that 91 matches expected 72.
23:11:52
23:11:52 /home/jenkins/workspace/mwext-testextension-hhvm-composer-jessie-non-voting/src/extensions/BlueSpiceFoundation/tests/BSApiExtJSStoreTestBase.php:85
23:11:52 /home/jenkins/workspace/mwext-testextension-hhvm-composer-jessie-non-voting/src/tests/phpunit/MediaWikiTestCase.php:400
23:11:52 /home/jenkins/workspace/mwext-testextension-hhvm-composer-jessie-non-voting/src/maintenance/doMaintenance.php:111
23:11:52
23:11:52 34) BSApiInsertMagicDataStoreTest::testPaging with data set #3 (4, 0)
23:11:52 Field "total" contains wrong value
23:11:52 Failed asserting that 91 matches expected 72.
23:11:52
23:11:52 /home/jenkins/workspace/mwext-testextension-hhvm-composer-jessie-non-voting/src/extensions/BlueSpiceFoundation/tests/BSApiExtJSStoreTestBase.php:85
23:11:52 /home/jenkins/workspace/mwext-testextension-hhvm-composer-jessie-non-voting/src/tests/phpunit/MediaWikiTestCase.php:400
23:11:52 /home/jenkins/workspace/mwext-testextension-hhvm-composer-jessie-non-voting/src/maintenance/doMaintenance.php:111
23:11:52
23:11:52 35) BSApiInsertMagicDataStoreTest::testPaging with data set #4 (4, 4)
23:11:52 Field "total" contains wrong value
23:11:52 Failed asserting that 91 matches expected 72.
23:11:52
23:11:52 /home/jenkins/workspace/mwext-testextension-hhvm-composer-jessie-non-voting/src/extensions/BlueSpiceFoundation/tests/BSApiExtJSStoreTestBase.php:85
23:11:52 /home/jenkins/workspace/mwext-testextension-hhvm-composer-jessie-non-voting/src/tests/phpunit/MediaWikiTestCase.php:400
23:11:52 /home/jenkins/workspace/mwext-testextension-hhvm-composer-jessie-non-voting/src/maintenance/doMaintenance.php:111
23:11:52
23:11:52 36) BSApiInsertMagicDataStoreTest::testPaging with data set #5 (4, 8)
23:11:52 Field "total" contains wrong value
23:11:52 Failed asserting that 91 matches expected 72.
23:11:52
23:11:52 /home/jenkins/workspace/mwext-testextension-hhvm-composer-jessie-non-voting/src/extensions/BlueSpiceFoundation/tests/BSApiExtJSStoreTestBase.php:85
23:11:52 /home/jenkins/workspace/mwext-testextension-hhvm-composer-jessie-non-voting/src/tests/phpunit/MediaWikiTestCase.php:400
23:11:52 /home/jenkins/workspace/mwext-testextension-hhvm-composer-jessie-non-voting/src/maintenance/doMaintenance.php:111
23:11:52
23:11:52 37) BSApiPageTemplatesStoreTest::testPaging with data set #0 (2, 0)
23:11:52 Field "total" contains wrong value
23:11:52 Failed asserting that 0 matches expected 8.
23:11:52
23:11:52 /home/jenkins/workspace/mwext-testextension-hhvm-composer-jessie-non-voting/src/extensions/BlueSpiceFoundation/tests/BSApiExtJSStoreTestBase.php:85
23:11:52 /home/jenkins/workspace/mwext-testextension-hhvm-composer-jessie-non-voting/src/tests/phpunit/MediaWikiTestCase.php:400
23:11:52 /home/jenkins/workspace/mwext-testextension-hhvm-composer-jessie-non-voting/src/maintenance/doMaintenance.php:111
23:11:52
23:11:52 38) BSApiPageTemplatesStoreTest::testPaging with data set #1 (2, 2)
23:11:52 Field "total" contains wrong value
23:11:52 Failed asserting that 0 matches expected 8.
23:11:52
23:11:52 /home/jenkins/workspace/mwext-testextension-hhvm-composer-jessie-non-voting/src/extensions/BlueSpiceFoundation/tests/BSApiExtJSStoreTestBase.php:85
23:11:52 /home/jenkins/workspace/mwext-testextension-hhvm-composer-jessie-non-voting/src/tests/phpunit/MediaWikiTestCase.php:400
23:11:52 /home/jenkins/workspace/mwext-testextension-hhvm-composer-jessie-non-voting/src/maintenance/doMaintenance.php:111
23:11:52
23:11:52 39) BSApiPageTemplatesStoreTest::testPaging with data set #2 (2, 4)
23:11:52 Field "total" contains wrong value
23:11:52 Failed asserting that 0 matches expected 8.
23:11:52
23:11:52 /home/jenkins/workspace/mwext-testextension-hhvm-composer-jessie-non-voting/src/extensions/BlueSpiceFoundation/tests/BSApiExtJSStoreTestBase.php:85
23:11:52 /home/jenkins/workspace/mwext-testextension-hhvm-composer-jessie-non-voting/src/tests/phpunit/MediaWikiTestCase.php:400
23:11:52 /home/jenkins/workspace/mwext-testextension-hhvm-composer-jessie-non-voting/src/maintenance/doMaintenance.php:111
23:11:52
23:11:52 40) BSApiPageTemplatesStoreTest::testPaging with data set #3 (4, 0)
23:11:52 Field "total" contains wrong value
23:11:52 Failed asserting that 0 matches expected 8.
23:11:52
23:11:52 /home/jenkins/workspace/mwext-testextension-hhvm-composer-jessie-non-voting/src/extensions/BlueSpiceFoundation/tests/BSApiExtJSStoreTestBase.php:85
23:11:52 /home/jenkins/workspace/mwext-testextension-hhvm-composer-jessie-non-voting/src/tests/phpunit/MediaWikiTestCase.php:400
23:11:52 /home/jenkins/workspace/mwext-testextension-hhvm-composer-jessie-non-voting/src/maintenance/doMaintenance.php:111
23:11:52
23:11:52 41) BSApiPageTemplatesStoreTest::testPaging with data set #4 (4, 4)
23:11:52 Field "total" contains wrong value
23:11:52 Failed asserting that 0 matches expected 8.
23:11:52
23:11:52 /home/jenkins/workspace/mwext-testextension-hhvm-composer-jessie-non-voting/src/extensions/BlueSpiceFoundation/tests/BSApiExtJSStoreTestBase.php:85
23:11:52 /home/jenkins/workspace/mwext-testextension-hhvm-composer-jessie-non-voting/src/tests/phpunit/MediaWikiTestCase.php:400
23:11:52 /home/jenkins/workspace/mwext-testextension-hhvm-composer-jessie-non-voting/src/maintenance/doMaintenance.php:111
23:11:52
23:11:52 42) BSApiPageTemplatesStoreTest::testPaging with data set #5 (4, 8)
23:11:52 Field "total" contains wrong value
23:11:52 Failed asserting that 0 matches expected 8.
23:11:52
23:11:52 /home/jenkins/workspace/mwext-testextension-hhvm-composer-jessie-non-voting/src/extensions/BlueSpiceFoundation/tests/BSApiExtJSStoreTestBase.php:85
23:11:52 /home/jenkins/workspace/mwext-testextension-hhvm-composer-jessie-non-voting/src/tests/phpunit/MediaWikiTestCase.php:400
23:11:52 /home/jenkins/workspace/mwext-testextension-hhvm-composer-jessie-non-voting/src/maintenance/doMaintenance.php:111
23:11:52
23:11:52 43) BSApiPageTemplatesStoreTest::testSingleFilter with data set "Filter by label" ('string', 'eq', 'label', 'Test 01', 1)
23:11:52 Field "total" contains wrong value
23:11:52 Failed asserting that 0 matches expected 1.
23:11:52
23:11:52 /home/jenkins/workspace/mwext-testextension-hhvm-composer-jessie-non-voting/src/extensions/BlueSpiceFoundation/tests/BSApiExtJSStoreTestBase.php:139
23:11:52 /home/jenkins/workspace/mwext-testextension-hhvm-composer-jessie-non-voting/src/tests/phpunit/MediaWikiTestCase.php:400
23:11:52 /home/jenkins/workspace/mwext-testextension-hhvm-composer-jessie-non-voting/src/maintenance/doMaintenance.php:111
23:11:52
23:11:52 44) BSApiPageTemplatesStoreTest::testMultipleFilter with data set "Filter by targetnsid and templatename" (array(array('integer', 'eq', 'targetnsid', 6), array('string', 'ct', 'label', '01')), 1)
23:11:52 Field "total" contains wrong value
23:11:52 Failed asserting that 0 matches expected 1.
23:11:52
23:11:52 /home/jenkins/workspace/mwext-testextension-hhvm-composer-jessie-non-voting/src/extensions/BlueSpiceFoundation/tests/BSApiExtJSStoreTestBase.php:163
23:11:52 /home/jenkins/workspace/mwext-testextension-hhvm-composer-jessie-non-voting/src/tests/phpunit/MediaWikiTestCase.php:400
23:11:52 /home/jenkins/workspace/mwext-testextension-hhvm-composer-jessie-non-voting/src/maintenance/doMaintenance.php:111
23:11:52
23:11:52 45) BSApiPageTemplatesTasksTest::testDoDeleteTemplates
23:11:52 Failed asserting that true is false.
23:11:52
23:11:52 /home/jenkins/workspace/mwext-testextension-hhvm-composer-jessie-non-voting/src/extensions/BlueSpiceExtensions/PageTemplates/tests/phpunit/BSApiPageTemplatesTasksTest.php:69
23:11:52 /home/jenkins/workspace/mwext-testextension-hhvm-composer-jessie-non-voting/src/tests/phpunit/MediaWikiTestCase.php:400
23:11:52 /home/jenkins/workspace/mwext-testextension-hhvm-composer-jessie-non-voting/src/maintenance/doMaintenance.php:111
23:11:52
23:11:52 46) BSPageTemplateListTest::testGrouping with data set "namespace main" (Title Object (...), 2, 4)
23:11:52 Failed asserting that 0 matches expected 2.
23:11:52
23:11:52 /home/jenkins/workspace/mwext-testextension-hhvm-composer-jessie-non-voting/src/extensions/BlueSpiceExtensions/PageTemplates/tests/phpunit/BSPageTemplateListTest.php:33
23:11:52 /home/jenkins/workspace/mwext-testextension-hhvm-composer-jessie-non-voting/src/tests/phpunit/MediaWikiTestCase.php:400
23:11:52 /home/jenkins/workspace/mwext-testextension-hhvm-composer-jessie-non-voting/src/maintenance/doMaintenance.php:111
23:11:52
23:11:52 47) BSPageTemplateListTest::testGrouping with data set "namespace help" (Title Object (...), 1, 5)
23:11:52 Failed asserting that 0 matches expected 1.
23:11:52
23:11:52 /home/jenkins/workspace/mwext-testextension-hhvm-composer-jessie-non-voting/src/extensions/BlueSpiceExtensions/PageTemplates/tests/phpunit/BSPageTemplateListTest.php:33
23:11:52 /home/jenkins/workspace/mwext-testextension-hhvm-composer-jessie-non-voting/src/tests/phpunit/MediaWikiTestCase.php:400
23:11:52 /home/jenkins/workspace/mwext-testextension-hhvm-composer-jessie-non-voting/src/maintenance/doMaintenance.php:111
23:11:52
23:11:52 48) BSPageTemplateListTest::testGrouping with data set "namespace file" (Title Object (...), 3, 3)
23:11:52 Failed asserting that 0 matches expected 3.
23:11:52
23:11:52 /home/jenkins/workspace/mwext-testextension-hhvm-composer-jessie-non-voting/src/extensions/BlueSpiceExtensions/PageTemplates/tests/phpunit/BSPageTemplateListTest.php:33
23:11:52 /home/jenkins/workspace/mwext-testextension-hhvm-composer-jessie-non-voting/src/tests/phpunit/MediaWikiTestCase.php:400
23:11:52 /home/jenkins/workspace/mwext-testextension-hhvm-composer-jessie-non-voting/src/maintenance/doMaintenance.php:111
23:11:52
23:11:52 49) BSPageTemplateListTest::testHideIfNotInTargetNamespace
23:11:52 Failed asserting that 1 matches expected 9.
23:11:52
23:11:52 /home/jenkins/workspace/mwext-testextension-hhvm-composer-jessie-non-voting/src/extensions/BlueSpiceExtensions/PageTemplates/tests/phpunit/BSPageTemplateListTest.php:79
23:11:52 /home/jenkins/workspace/mwext-testextension-hhvm-composer-jessie-non-voting/src/tests/phpunit/MediaWikiTestCase.php:400
23:11:52 /home/jenkins/workspace/mwext-testextension-hhvm-composer-jessie-non-voting/src/maintenance/doMaintenance.php:111
23:11:52
23:11:52 50) BSPageTemplateListTest::testHideDefaults
23:11:52 Failed asserting that 1 matches expected 5.
23:11:52
23:11:52 /home/jenkins/workspace/mwext-testextension-hhvm-composer-jessie-non-voting/src/extensions/BlueSpiceExtensions/PageTemplates/tests/phpunit/BSPageTemplateListTest.php:97
23:11:52 /home/jenkins/workspace/mwext-testextension-hhvm-composer-jessie-non-voting/src/tests/phpunit/MediaWikiTestCase.php:400
23:11:52 /home/jenkins/workspace/mwext-testextension-hhvm-composer-jessie-non-voting/src/maintenance/doMaintenance.php:111
23:11:52

Event Timeline