Page MenuHomePhabricator
Paste P62956

PHPUnit MediaWiki core test failures with temp accounts - mediawiki-quibble-vendor-mysql-php74
ActivePublic

Authored by kostajh on May 23 2024, 7:08 AM.
15:10:21 There were 96 errors:
15:10:21
15:10:21 1) RecentChangeTest::testDatabaseRoundTrip with data set "anon user" (array(5, 'foo', 0, '192.168.0.1', '20240626130359', 2, 'Tony', 0, 77, '', '', null, 70, 71, 0, '', 0, 0, 80, 88, 0, 0, null, '', ''))
15:10:21 CannotCreateActorException: Cannot create an actor for an IP user when temporary accounts are enabled
15:10:21
15:10:21 /workspace/src/includes/user/ActorStore.php:638
15:10:21 /workspace/src/includes/user/ActorStore.php:415
15:10:21 /workspace/src/includes/changes/RecentChange.php:452
15:10:21 /workspace/src/tests/phpunit/includes/changes/RecentChangeTest.php:133
15:10:21 phpvfscomposer:///workspace/src/vendor/phpunit/phpunit/phpunit:106
Logs generated by test
Show Details
15:10:21
15:10:21 2) EditPageConstraintsTest::testEditRightConstraint with data set "Anonymous user" (true, 218)
15:10:21 CannotCreateActorException: Cannot create an actor for an IP user when temporary accounts are enabled
15:10:21
15:10:21 /workspace/src/includes/user/ActorStore.php:638
15:10:21 /workspace/src/includes/user/ActorStore.php:415
15:10:21 /workspace/src/includes/Revision/RevisionStore.php:891
15:10:21 /workspace/src/includes/Revision/RevisionStore.php:768
15:10:21 /workspace/src/includes/Revision/RevisionStore.php:634
15:10:21 /workspace/src/includes/Revision/RevisionStore.php:485
15:10:21 /workspace/src/includes/libs/rdbms/database/Database.php:2269
15:10:21 /workspace/src/includes/libs/rdbms/database/DBConnRef.php:127
15:10:21 /workspace/src/includes/libs/rdbms/database/DBConnRef.php:654
15:10:21 /workspace/src/includes/Revision/RevisionStore.php:493
15:10:21 /workspace/src/includes/Storage/PageUpdater.php:1506
15:10:21 /workspace/src/includes/Storage/PageUpdater.php:925
15:10:21 /workspace/src/includes/page/WikiPage.php:1692
15:10:21 /workspace/src/tests/phpunit/includes/editpage/EditPageConstraintsTest.php:91
15:10:21 /workspace/src/tests/phpunit/includes/editpage/EditPageConstraintsTest.php:427
15:10:21 phpvfscomposer:///workspace/src/vendor/phpunit/phpunit/phpunit:106
Logs generated by test
Show Details
15:10:21
15:10:21 3) EditPageTest::testUpdateNoMinor
15:10:21 CannotCreateActorException: Cannot create an actor for an IP user when temporary accounts are enabled
15:10:21
15:10:21 /workspace/src/includes/user/ActorStore.php:638
15:10:21 /workspace/src/includes/user/ActorStore.php:415
15:10:21 /workspace/src/includes/Revision/RevisionStore.php:891
15:10:21 /workspace/src/includes/Revision/RevisionStore.php:768
15:10:21 /workspace/src/includes/Revision/RevisionStore.php:634
15:10:21 /workspace/src/includes/Revision/RevisionStore.php:485
15:10:21 /workspace/src/includes/libs/rdbms/database/Database.php:2269
15:10:21 /workspace/src/includes/libs/rdbms/database/DBConnRef.php:127
15:10:21 /workspace/src/includes/libs/rdbms/database/DBConnRef.php:654
15:10:21 /workspace/src/includes/Revision/RevisionStore.php:493
15:10:21 /workspace/src/includes/Storage/PageUpdater.php:1375
15:10:21 /workspace/src/includes/Storage/PageUpdater.php:923
15:10:21 /workspace/src/includes/editpage/EditPage.php:2505
15:10:21 /workspace/src/includes/editpage/EditPage.php:1780
15:10:21 /workspace/src/tests/phpunit/includes/editpage/EditPageTest.php:218
15:10:21 /workspace/src/tests/phpunit/includes/editpage/EditPageTest.php:464
15:10:21 phpvfscomposer:///workspace/src/vendor/phpunit/phpunit/phpunit:106
Logs generated by test
Show Details
15:10:21
15:10:21 4) AuthenticatedFileEntryPointTest::testGetRequestPathSuffix with data set #0 ('/upload', '/upload/file', 'file')
15:10:21 CannotCreateActorException: Cannot create an actor for an IP user when temporary accounts are enabled
15:10:21
15:10:21 /workspace/src/includes/user/ActorStore.php:638
15:10:21 /workspace/src/includes/user/ActorStore.php:415
15:10:21 /workspace/src/includes/filerepo/file/LocalFile.php:1757
15:10:21 /workspace/src/includes/filerepo/file/LocalFile.php:1675
15:10:21 /workspace/src/tests/phpunit/mocks/filerepo/TestRepoTrait.php:235
15:10:21 /workspace/src/tests/phpunit/includes/filerepo/AuthenticatedFileEntryPointTest.php:32
15:10:21 /workspace/src/tests/phpunit/MediaWikiIntegrationTestCase.php:697
15:10:21 /workspace/src/tests/phpunit/MediaWikiIntegrationTestCase.php:632
15:10:21 phpvfscomposer:///workspace/src/vendor/phpunit/phpunit/phpunit:106
Logs generated by test
Show Details
15:10:21
15:10:21 5) AuthenticatedFileEntryPointTest::testStreamFile_archive
15:10:21 Undefined offset: 0
15:10:21
15:10:21 /workspace/src/tests/phpunit/includes/filerepo/AuthenticatedFileEntryPointTest.php:303
15:10:21 phpvfscomposer:///workspace/src/vendor/phpunit/phpunit/phpunit:106
Logs generated by test
Show Details
15:10:21
15:10:21 6) AuthenticatedFileEntryPointTest::testAccessDenied_deleted
15:10:21 Undefined offset: 0
15:10:21
15:10:21 /workspace/src/tests/phpunit/includes/filerepo/AuthenticatedFileEntryPointTest.php:343
15:10:21 phpvfscomposer:///workspace/src/vendor/phpunit/phpunit/phpunit:106
Logs generated by test
Show Details
15:10:21
15:10:21 7) Thumbnail404EntryPointTest::testNotFound with data set "non-existing image" ('/w/images/thumb/a/aa/Xyzzy.pn...zy.png', 404)
15:10:21 CannotCreateActorException: Cannot create an actor for an IP user when temporary accounts are enabled
15:10:21
15:10:21 /workspace/src/includes/user/ActorStore.php:638
15:10:21 /workspace/src/includes/user/ActorStore.php:415
15:10:21 /workspace/src/includes/filerepo/file/LocalFile.php:1757
15:10:21 /workspace/src/includes/filerepo/file/LocalFile.php:1675
15:10:21 /workspace/src/tests/phpunit/mocks/filerepo/TestRepoTrait.php:235
15:10:21 /workspace/src/tests/phpunit/includes/filerepo/Thumbnail404EntryPointTest.php:32
15:10:21 /workspace/src/tests/phpunit/MediaWikiIntegrationTestCase.php:697
15:10:21 /workspace/src/tests/phpunit/MediaWikiIntegrationTestCase.php:632
15:10:21 phpvfscomposer:///workspace/src/vendor/phpunit/phpunit/phpunit:106
Logs generated by test
Show Details
15:10:21
15:10:21 8) ThumbnailEntryPointTest::testNotFound
15:10:21 CannotCreateActorException: Cannot create an actor for an IP user when temporary accounts are enabled
15:10:21
15:10:21 /workspace/src/includes/user/ActorStore.php:638
15:10:21 /workspace/src/includes/user/ActorStore.php:415
15:10:21 /workspace/src/includes/filerepo/file/LocalFile.php:1757
15:10:21 /workspace/src/includes/filerepo/file/LocalFile.php:1675
15:10:21 /workspace/src/tests/phpunit/mocks/filerepo/TestRepoTrait.php:235
15:10:21 /workspace/src/tests/phpunit/includes/filerepo/ThumbnailEntryPointTest.php:39
15:10:21 /workspace/src/tests/phpunit/MediaWikiIntegrationTestCase.php:697
15:10:21 /workspace/src/tests/phpunit/MediaWikiIntegrationTestCase.php:632
15:10:21 phpvfscomposer:///workspace/src/vendor/phpunit/phpunit/phpunit:106
Logs generated by test
Show Details
15:10:21
15:10:21 9) ThumbnailEntryPointTest::testOldDeletedFile
15:10:21 Undefined offset: 0
15:10:21
15:10:21 /workspace/src/tests/phpunit/includes/filerepo/ThumbnailEntryPointTest.php:518
15:10:21 phpvfscomposer:///workspace/src/vendor/phpunit/phpunit/phpunit:106
Logs generated by test
Show Details
15:10:21
15:10:21 10) LocalFileTest::testGetUploader with data set "Deleted, RAW" (Mock_Authority_18e22b6f Object (...), 3, 6, true)
15:10:21 CannotCreateActorException: Cannot create an actor for an IP user when temporary accounts are enabled
15:10:21
15:10:21 /workspace/src/includes/user/ActorStore.php:638
15:10:21 /workspace/src/includes/user/ActorStore.php:415
15:10:21 /workspace/src/tests/phpunit/includes/filerepo/file/LocalFileTest.php:354
15:10:21 /workspace/src/tests/phpunit/includes/filerepo/file/LocalFileTest.php:413
15:10:21 phpvfscomposer:///workspace/src/vendor/phpunit/phpunit/phpunit:106
Logs generated by test
Show Details
15:10:21
15:10:21 11) LocalFileTest::testGetUploader with data set "No permission, not deleted" (Mock_Authority_18e22b6f Object (...), 2, 0, true)
15:10:21 CannotCreateActorException: Cannot create an actor for an IP user when temporary accounts are enabled
15:10:21
15:10:21 /workspace/src/includes/user/ActorStore.php:638
15:10:21 /workspace/src/includes/user/ActorStore.php:415
15:10:21 /workspace/src/tests/phpunit/includes/filerepo/file/LocalFileTest.php:354
15:10:21 /workspace/src/tests/phpunit/includes/filerepo/file/LocalFileTest.php:413
15:10:21 phpvfscomposer:///workspace/src/vendor/phpunit/phpunit/phpunit:106
Logs generated by test
Show Details
15:10:21
15:10:21 12) LocalFileTest::testGetUploader with data set "No permission, deleted" (Mock_Authority_18e22b6f Object (...), 2, 6, false)
15:10:21 CannotCreateActorException: Cannot create an actor for an IP user when temporary accounts are enabled
15:10:21
15:10:21 /workspace/src/includes/user/ActorStore.php:638
15:10:21 /workspace/src/includes/user/ActorStore.php:415
15:10:21 /workspace/src/tests/phpunit/includes/filerepo/file/LocalFileTest.php:354
15:10:21 /workspace/src/tests/phpunit/includes/filerepo/file/LocalFileTest.php:413
15:10:21 phpvfscomposer:///workspace/src/vendor/phpunit/phpunit/phpunit:106
Logs generated by test
Show Details
15:10:21
15:10:21 13) LocalFileTest::testGetUploader with data set "Not deleted, public" (MediaWiki\Permissions\SimpleAuthority Object (...), 1, 0, true)
15:10:21 CannotCreateActorException: Cannot create an actor for an IP user when temporary accounts are enabled
15:10:21
15:10:21 /workspace/src/includes/user/ActorStore.php:638
15:10:21 /workspace/src/includes/user/ActorStore.php:415
15:10:21 /workspace/src/tests/phpunit/includes/filerepo/file/LocalFileTest.php:354
15:10:21 /workspace/src/tests/phpunit/includes/filerepo/file/LocalFileTest.php:413
15:10:21 phpvfscomposer:///workspace/src/vendor/phpunit/phpunit/phpunit:106
Logs generated by test
Show Details
15:10:21
15:10:21 14) LocalFileTest::testGetUploader with data set "Deleted, public" (MediaWiki\Permissions\SimpleAuthority Object (...), 1, 6, false)
15:10:21 CannotCreateActorException: Cannot create an actor for an IP user when temporary accounts are enabled
15:10:21
15:10:21 /workspace/src/includes/user/ActorStore.php:638
15:10:21 /workspace/src/includes/user/ActorStore.php:415
15:10:21 /workspace/src/tests/phpunit/includes/filerepo/file/LocalFileTest.php:354
15:10:21 /workspace/src/tests/phpunit/includes/filerepo/file/LocalFileTest.php:413
15:10:21 phpvfscomposer:///workspace/src/vendor/phpunit/phpunit/phpunit:106
Logs generated by test
Show Details
15:10:21
15:10:21 15) LocalFileTest::testGetUploader with data set "With permission, deleted" (MediaWiki\Permissions\SimpleAuthority Object (...), 2, 6, true)
15:10:21 CannotCreateActorException: Cannot create an actor for an IP user when temporary accounts are enabled
15:10:21
15:10:21 /workspace/src/includes/user/ActorStore.php:638
15:10:21 /workspace/src/includes/user/ActorStore.php:415
15:10:21 /workspace/src/tests/phpunit/includes/filerepo/file/LocalFileTest.php:354
15:10:21 /workspace/src/tests/phpunit/includes/filerepo/file/LocalFileTest.php:413
15:10:21 phpvfscomposer:///workspace/src/vendor/phpunit/phpunit/phpunit:106
Logs generated by test
Show Details
15:10:21
15:10:21 16) LocalFileTest::testGetDescription with data set "Deleted, RAW" (Mock_Authority_18e22b6f Object (...), 3, 6, true)
15:10:21 CannotCreateActorException: Cannot create an actor for an IP user when temporary accounts are enabled
15:10:21
15:10:21 /workspace/src/includes/user/ActorStore.php:638
15:10:21 /workspace/src/includes/user/ActorStore.php:415
15:10:21 /workspace/src/tests/phpunit/includes/filerepo/file/LocalFileTest.php:393
15:10:21 /workspace/src/tests/phpunit/includes/filerepo/file/LocalFileTest.php:431
15:10:21 phpvfscomposer:///workspace/src/vendor/phpunit/phpunit/phpunit:106
Logs generated by test
Show Details
15:10:21
15:10:21 17) LocalFileTest::testGetDescription with data set "No permission, not deleted" (Mock_Authority_18e22b6f Object (...), 2, 0, true)
15:10:21 CannotCreateActorException: Cannot create an actor for an IP user when temporary accounts are enabled
15:10:21
15:10:21 /workspace/src/includes/user/ActorStore.php:638
15:10:21 /workspace/src/includes/user/ActorStore.php:415
15:10:21 /workspace/src/tests/phpunit/includes/filerepo/file/LocalFileTest.php:393
15:10:21 /workspace/src/tests/phpunit/includes/filerepo/file/LocalFileTest.php:431
15:10:21 phpvfscomposer:///workspace/src/vendor/phpunit/phpunit/phpunit:106
Logs generated by test
Show Details
15:10:21
15:10:21 18) LocalFileTest::testGetDescription with data set "No permission, deleted" (Mock_Authority_18e22b6f Object (...), 2, 6, false)
15:10:21 CannotCreateActorException: Cannot create an actor for an IP user when temporary accounts are enabled
15:10:21
15:10:21 /workspace/src/includes/user/ActorStore.php:638
15:10:21 /workspace/src/includes/user/ActorStore.php:415
15:10:21 /workspace/src/tests/phpunit/includes/filerepo/file/LocalFileTest.php:393
15:10:21 /workspace/src/tests/phpunit/includes/filerepo/file/LocalFileTest.php:431
15:10:21 phpvfscomposer:///workspace/src/vendor/phpunit/phpunit/phpunit:106
Logs generated by test
Show Details
15:10:21
15:10:21 19) LocalFileTest::testGetDescription with data set "Not deleted, public" (MediaWiki\Permissions\SimpleAuthority Object (...), 1, 0, true)
15:10:21 CannotCreateActorException: Cannot create an actor for an IP user when temporary accounts are enabled
15:10:21
15:10:21 /workspace/src/includes/user/ActorStore.php:638
15:10:21 /workspace/src/includes/user/ActorStore.php:415
15:10:21 /workspace/src/tests/phpunit/includes/filerepo/file/LocalFileTest.php:393
15:10:21 /workspace/src/tests/phpunit/includes/filerepo/file/LocalFileTest.php:431
15:10:21 phpvfscomposer:///workspace/src/vendor/phpunit/phpunit/phpunit:106
Logs generated by test
Show Details
15:10:21
15:10:21 20) LocalFileTest::testGetDescription with data set "Deleted, public" (MediaWiki\Permissions\SimpleAuthority Object (...), 1, 6, false)
15:10:21 CannotCreateActorException: Cannot create an actor for an IP user when temporary accounts are enabled
15:10:21
15:10:21 /workspace/src/includes/user/ActorStore.php:638
15:10:21 /workspace/src/includes/user/ActorStore.php:415
15:10:21 /workspace/src/tests/phpunit/includes/filerepo/file/LocalFileTest.php:393
15:10:21 /workspace/src/tests/phpunit/includes/filerepo/file/LocalFileTest.php:431
15:10:21 phpvfscomposer:///workspace/src/vendor/phpunit/phpunit/phpunit:106
Logs generated by test
Show Details
15:10:21
15:10:21 21) LocalFileTest::testGetDescription with data set "With permission, deleted" (MediaWiki\Permissions\SimpleAuthority Object (...), 2, 6, true)
15:10:21 CannotCreateActorException: Cannot create an actor for an IP user when temporary accounts are enabled
15:10:21
15:10:21 /workspace/src/includes/user/ActorStore.php:638
15:10:21 /workspace/src/includes/user/ActorStore.php:415
15:10:21 /workspace/src/tests/phpunit/includes/filerepo/file/LocalFileTest.php:393
15:10:21 /workspace/src/tests/phpunit/includes/filerepo/file/LocalFileTest.php:431
15:10:21 phpvfscomposer:///workspace/src/vendor/phpunit/phpunit/phpunit:106
Logs generated by test
Show Details
15:10:21
15:10:21 22) LocalFileTest::testArchivedGetUploader with data set "Deleted, RAW" (Mock_Authority_18e22b6f Object (...), 3, 6, true)
15:10:21 CannotCreateActorException: Cannot create an actor for an IP user when temporary accounts are enabled
15:10:21
15:10:21 /workspace/src/includes/user/ActorStore.php:638
15:10:21 /workspace/src/includes/user/ActorStore.php:415
15:10:21 /workspace/src/tests/phpunit/includes/filerepo/file/LocalFileTest.php:393
15:10:21 /workspace/src/tests/phpunit/includes/filerepo/file/LocalFileTest.php:449
15:10:21 phpvfscomposer:///workspace/src/vendor/phpunit/phpunit/phpunit:106
Logs generated by test
Show Details
15:10:21
15:10:21 23) LocalFileTest::testArchivedGetUploader with data set "No permission, not deleted" (Mock_Authority_18e22b6f Object (...), 2, 0, true)
15:10:21 CannotCreateActorException: Cannot create an actor for an IP user when temporary accounts are enabled
15:10:21
15:10:21 /workspace/src/includes/user/ActorStore.php:638
15:10:21 /workspace/src/includes/user/ActorStore.php:415
15:10:21 /workspace/src/tests/phpunit/includes/filerepo/file/LocalFileTest.php:393
15:10:21 /workspace/src/tests/phpunit/includes/filerepo/file/LocalFileTest.php:449
15:10:21 phpvfscomposer:///workspace/src/vendor/phpunit/phpunit/phpunit:106
Logs generated by test
Show Details
15:10:21
15:10:21 24) LocalFileTest::testArchivedGetUploader with data set "No permission, deleted" (Mock_Authority_18e22b6f Object (...), 2, 6, false)
15:10:21 CannotCreateActorException: Cannot create an actor for an IP user when temporary accounts are enabled
15:10:21
15:10:21 /workspace/src/includes/user/ActorStore.php:638
15:10:21 /workspace/src/includes/user/ActorStore.php:415
15:10:21 /workspace/src/tests/phpunit/includes/filerepo/file/LocalFileTest.php:393
15:10:21 /workspace/src/tests/phpunit/includes/filerepo/file/LocalFileTest.php:449
15:10:21 phpvfscomposer:///workspace/src/vendor/phpunit/phpunit/phpunit:106
Logs generated by test
Show Details
15:10:21
15:10:21 25) LocalFileTest::testArchivedGetUploader with data set "Not deleted, public" (MediaWiki\Permissions\SimpleAuthority Object (...), 1, 0, true)
15:10:21 CannotCreateActorException: Cannot create an actor for an IP user when temporary accounts are enabled
15:10:21
15:10:21 /workspace/src/includes/user/ActorStore.php:638
15:10:21 /workspace/src/includes/user/ActorStore.php:415
15:10:21 /workspace/src/tests/phpunit/includes/filerepo/file/LocalFileTest.php:393
15:10:21 /workspace/src/tests/phpunit/includes/filerepo/file/LocalFileTest.php:449
15:10:21 phpvfscomposer:///workspace/src/vendor/phpunit/phpunit/phpunit:106
Logs generated by test
Show Details
15:10:21
15:10:21 26) LocalFileTest::testArchivedGetUploader with data set "Deleted, public" (MediaWiki\Permissions\SimpleAuthority Object (...), 1, 6, false)
15:10:21 CannotCreateActorException: Cannot create an actor for an IP user when temporary accounts are enabled
15:10:21
15:10:21 /workspace/src/includes/user/ActorStore.php:638
15:10:21 /workspace/src/includes/user/ActorStore.php:415
15:10:21 /workspace/src/tests/phpunit/includes/filerepo/file/LocalFileTest.php:393
15:10:21 /workspace/src/tests/phpunit/includes/filerepo/file/LocalFileTest.php:449
15:10:21 phpvfscomposer:///workspace/src/vendor/phpunit/phpunit/phpunit:106
Logs generated by test
Show Details
15:10:21
15:10:21 27) LocalFileTest::testArchivedGetUploader with data set "With permission, deleted" (MediaWiki\Permissions\SimpleAuthority Object (...), 2, 6, true)
15:10:21 CannotCreateActorException: Cannot create an actor for an IP user when temporary accounts are enabled
15:10:21
15:10:21 /workspace/src/includes/user/ActorStore.php:638
15:10:21 /workspace/src/includes/user/ActorStore.php:415
15:10:21 /workspace/src/tests/phpunit/includes/filerepo/file/LocalFileTest.php:393
15:10:21 /workspace/src/tests/phpunit/includes/filerepo/file/LocalFileTest.php:449
15:10:21 phpvfscomposer:///workspace/src/vendor/phpunit/phpunit/phpunit:106
Logs generated by test
Show Details
15:10:21
15:10:21 28) LocalFileTest::testArchivedGetDescription with data set "Deleted, RAW" (Mock_Authority_18e22b6f Object (...), 3, 6, true)
15:10:21 CannotCreateActorException: Cannot create an actor for an IP user when temporary accounts are enabled
15:10:21
15:10:21 /workspace/src/includes/user/ActorStore.php:638
15:10:21 /workspace/src/includes/user/ActorStore.php:415
15:10:21 /workspace/src/tests/phpunit/includes/filerepo/file/LocalFileTest.php:354
15:10:21 /workspace/src/tests/phpunit/includes/filerepo/file/LocalFileTest.php:467
15:10:21 phpvfscomposer:///workspace/src/vendor/phpunit/phpunit/phpunit:106
Logs generated by test
Show Details
15:10:21
15:10:21 29) LocalFileTest::testArchivedGetDescription with data set "No permission, not deleted" (Mock_Authority_18e22b6f Object (...), 2, 0, true)
15:10:21 CannotCreateActorException: Cannot create an actor for an IP user when temporary accounts are enabled
15:10:21
15:10:21 /workspace/src/includes/user/ActorStore.php:638
15:10:21 /workspace/src/includes/user/ActorStore.php:415
15:10:21 /workspace/src/tests/phpunit/includes/filerepo/file/LocalFileTest.php:354
15:10:21 /workspace/src/tests/phpunit/includes/filerepo/file/LocalFileTest.php:467
15:10:21 phpvfscomposer:///workspace/src/vendor/phpunit/phpunit/phpunit:106
Logs generated by test
Show Details
15:10:21
15:10:21 30) LocalFileTest::testArchivedGetDescription with data set "No permission, deleted" (Mock_Authority_18e22b6f Object (...), 2, 6, false)
15:10:21 CannotCreateActorException: Cannot create an actor for an IP user when temporary accounts are enabled
15:10:21
15:10:21 /workspace/src/includes/user/ActorStore.php:638
15:10:21 /workspace/src/includes/user/ActorStore.php:415
15:10:21 /workspace/src/tests/phpunit/includes/filerepo/file/LocalFileTest.php:354
15:10:21 /workspace/src/tests/phpunit/includes/filerepo/file/LocalFileTest.php:467
15:10:21 phpvfscomposer:///workspace/src/vendor/phpunit/phpunit/phpunit:106
Logs generated by test
Show Details
15:10:21
15:10:21 31) LocalFileTest::testArchivedGetDescription with data set "Not deleted, public" (MediaWiki\Permissions\SimpleAuthority Object (...), 1, 0, true)
15:10:21 CannotCreateActorException: Cannot create an actor for an IP user when temporary accounts are enabled
15:10:21
15:10:21 /workspace/src/includes/user/ActorStore.php:638
15:10:21 /workspace/src/includes/user/ActorStore.php:415
15:10:21 /workspace/src/tests/phpunit/includes/filerepo/file/LocalFileTest.php:354
15:10:21 /workspace/src/tests/phpunit/includes/filerepo/file/LocalFileTest.php:467
15:10:21 phpvfscomposer:///workspace/src/vendor/phpunit/phpunit/phpunit:106
Logs generated by test
Show Details
15:10:21
15:10:21 32) LocalFileTest::testArchivedGetDescription with data set "Deleted, public" (MediaWiki\Permissions\SimpleAuthority Object (...), 1, 6, false)
15:10:21 CannotCreateActorException: Cannot create an actor for an IP user when temporary accounts are enabled
15:10:21
15:10:21 /workspace/src/includes/user/ActorStore.php:638
15:10:21 /workspace/src/includes/user/ActorStore.php:415
15:10:21 /workspace/src/tests/phpunit/includes/filerepo/file/LocalFileTest.php:354
15:10:21 /workspace/src/tests/phpunit/includes/filerepo/file/LocalFileTest.php:467
15:10:21 phpvfscomposer:///workspace/src/vendor/phpunit/phpunit/phpunit:106
Logs generated by test
Show Details
15:10:21
15:10:21 33) LocalFileTest::testArchivedGetDescription with data set "With permission, deleted" (MediaWiki\Permissions\SimpleAuthority Object (...), 2, 6, true)
15:10:21 CannotCreateActorException: Cannot create an actor for an IP user when temporary accounts are enabled
15:10:21
15:10:21 /workspace/src/includes/user/ActorStore.php:638
15:10:21 /workspace/src/includes/user/ActorStore.php:415
15:10:21 /workspace/src/tests/phpunit/includes/filerepo/file/LocalFileTest.php:354
15:10:21 /workspace/src/tests/phpunit/includes/filerepo/file/LocalFileTest.php:467
15:10:21 phpvfscomposer:///workspace/src/vendor/phpunit/phpunit/phpunit:106
Logs generated by test
Show Details
15:10:21
15:10:21 34) LocalFileTest::testUpload
15:10:21 CannotCreateActorException: Cannot create an actor for an IP user when temporary accounts are enabled
15:10:21
15:10:21 /workspace/src/includes/user/ActorStore.php:638
15:10:21 /workspace/src/includes/user/ActorStore.php:415
15:10:21 /workspace/src/includes/filerepo/file/LocalFile.php:1757
15:10:21 /workspace/src/includes/filerepo/file/LocalFile.php:1675
15:10:21 /workspace/src/tests/phpunit/includes/filerepo/file/LocalFileTest.php:872
15:10:21 phpvfscomposer:///workspace/src/vendor/phpunit/phpunit/phpunit:106
Logs generated by test
Show Details
15:10:21
15:10:21 35) ImportLinkCacheIntegrationTest::testImportForImportSource
15:10:21 CannotCreateActorException: Cannot create an actor for an IP user when temporary accounts are enabled
15:10:21
15:10:21 /workspace/src/includes/user/ActorStore.php:638
15:10:21 /workspace/src/includes/user/ActorStore.php:415
15:10:21 /workspace/src/includes/Revision/RevisionStore.php:891
15:10:21 /workspace/src/includes/Revision/RevisionStore.php:768
15:10:21 /workspace/src/includes/Revision/RevisionStore.php:634
15:10:21 /workspace/src/includes/Revision/RevisionStore.php:485
15:10:21 /workspace/src/includes/libs/rdbms/database/Database.php:2269
15:10:21 /workspace/src/includes/libs/rdbms/database/DBConnRef.php:127
15:10:21 /workspace/src/includes/libs/rdbms/database/DBConnRef.php:654
15:10:21 /workspace/src/includes/Revision/RevisionStore.php:493
15:10:21 /workspace/src/includes/specials/helpers/ImportReporter.php:165
15:10:21 /workspace/src/includes/import/WikiImporter.php:596
15:10:21 /workspace/src/includes/import/WikiImporter.php:935
15:10:21 /workspace/src/includes/import/WikiImporter.php:728
15:10:21 /workspace/src/tests/phpunit/includes/import/ImportLinkCacheIntegrationTest.php:89
15:10:21 /workspace/src/tests/phpunit/includes/import/ImportLinkCacheIntegrationTest.php:34
15:10:21 phpvfscomposer:///workspace/src/vendor/phpunit/phpunit/phpunit:106
Logs generated by test
Show Details
15:10:21
15:10:21 36) LinkerTest::testGenerateRollback with data set #0 (true, array('mediawiki.misc-authed-curate'), 'Rollback_Test_Page')
15:10:21 CannotCreateActorException: Cannot create an actor for an IP user when temporary accounts are enabled
15:10:21
15:10:21 /workspace/src/includes/user/ActorStore.php:638
15:10:21 /workspace/src/includes/user/ActorStore.php:415
15:10:21 /workspace/src/includes/Revision/RevisionStore.php:891
15:10:21 /workspace/src/includes/Revision/RevisionStore.php:768
15:10:21 /workspace/src/includes/Revision/RevisionStore.php:634
15:10:21 /workspace/src/includes/Revision/RevisionStore.php:485
15:10:21 /workspace/src/includes/libs/rdbms/database/Database.php:2269
15:10:21 /workspace/src/includes/libs/rdbms/database/DBConnRef.php:127
15:10:21 /workspace/src/includes/libs/rdbms/database/DBConnRef.php:654
15:10:21 /workspace/src/includes/Revision/RevisionStore.php:493
15:10:21 /workspace/src/includes/Storage/PageUpdater.php:1375
15:10:21 /workspace/src/includes/Storage/PageUpdater.php:923
15:10:21 /workspace/src/tests/phpunit/includes/linker/LinkerTest.php:283
15:10:21 phpvfscomposer:///workspace/src/vendor/phpunit/phpunit/phpunit:106
Logs generated by test
Show Details
15:10:21
15:10:21 37) LinkerTest::testGenerateRollback with data set #1 (false, array(), 'Rollback_Test_Page2')
15:10:21 CannotCreateActorException: Cannot create an actor for an IP user when temporary accounts are enabled
15:10:21
15:10:21 /workspace/src/includes/user/ActorStore.php:638
15:10:21 /workspace/src/includes/user/ActorStore.php:415
15:10:21 /workspace/src/includes/Revision/RevisionStore.php:891
15:10:21 /workspace/src/includes/Revision/RevisionStore.php:768
15:10:21 /workspace/src/includes/Revision/RevisionStore.php:634
15:10:21 /workspace/src/includes/Revision/RevisionStore.php:485
15:10:21 /workspace/src/includes/libs/rdbms/database/Database.php:2269
15:10:21 /workspace/src/includes/libs/rdbms/database/DBConnRef.php:127
15:10:21 /workspace/src/includes/libs/rdbms/database/DBConnRef.php:654
15:10:21 /workspace/src/includes/Revision/RevisionStore.php:493
15:10:21 /workspace/src/includes/Storage/PageUpdater.php:1375
15:10:21 /workspace/src/includes/Storage/PageUpdater.php:923
15:10:21 /workspace/src/tests/phpunit/includes/linker/LinkerTest.php:283
15:10:21 phpvfscomposer:///workspace/src/vendor/phpunit/phpunit/phpunit:106
Logs generated by test
Show Details
15:10:21
15:10:21 38) ArticleTablesTest::testTemplatelinksUsesContentLanguage
15:10:21 CannotCreateActorException: Cannot create an actor for an IP user when temporary accounts are enabled
15:10:21
15:10:21 /workspace/src/includes/user/ActorStore.php:638
15:10:21 /workspace/src/includes/user/ActorStore.php:415
15:10:21 /workspace/src/includes/Revision/RevisionStore.php:891
15:10:21 /workspace/src/includes/Revision/RevisionStore.php:768
15:10:21 /workspace/src/includes/Revision/RevisionStore.php:634
15:10:21 /workspace/src/includes/Revision/RevisionStore.php:485
15:10:21 /workspace/src/includes/libs/rdbms/database/Database.php:2269
15:10:21 /workspace/src/includes/libs/rdbms/database/DBConnRef.php:127
15:10:21 /workspace/src/includes/libs/rdbms/database/DBConnRef.php:654
15:10:21 /workspace/src/includes/Revision/RevisionStore.php:493
15:10:21 /workspace/src/includes/Storage/PageUpdater.php:1506
15:10:21 /workspace/src/includes/Storage/PageUpdater.php:925
15:10:21 /workspace/src/includes/page/WikiPage.php:1692
15:10:21 /workspace/src/tests/phpunit/includes/page/ArticleTablesTest.php:31
15:10:21 phpvfscomposer:///workspace/src/vendor/phpunit/phpunit/phpunit:106
Logs generated by test
Show Details
15:10:21
15:10:21 39) ArticleViewTest::testViewOfDeletedRevision
15:10:21 CannotCreateActorException: Cannot create an actor for an IP user when temporary accounts are enabled
15:10:21
15:10:21 /workspace/src/includes/user/ActorStore.php:638
15:10:21 /workspace/src/includes/user/ActorStore.php:415
15:10:21 /workspace/src/includes/logging/ManualLogEntry.php:299
15:10:21 /workspace/src/includes/revisiondelete/RevDelList.php:389
15:10:21 /workspace/src/includes/revisiondelete/RevDelList.php:304
15:10:21 /workspace/src/tests/phpunit/includes/page/ArticleViewTest.php:382
15:10:21 phpvfscomposer:///workspace/src/vendor/phpunit/phpunit/phpunit:106
Logs generated by test
Show Details
15:10:21
15:10:21 40) ArticleViewTest::testUnhiddenViewOfDeletedRevision
15:10:21 CannotCreateActorException: Cannot create an actor for an IP user when temporary accounts are enabled
15:10:21
15:10:21 /workspace/src/includes/user/ActorStore.php:638
15:10:21 /workspace/src/includes/user/ActorStore.php:415
15:10:21 /workspace/src/includes/logging/ManualLogEntry.php:299
15:10:21 /workspace/src/includes/revisiondelete/RevDelList.php:389
15:10:21 /workspace/src/includes/revisiondelete/RevDelList.php:304
15:10:21 /workspace/src/tests/phpunit/includes/page/ArticleViewTest.php:405
15:10:21 phpvfscomposer:///workspace/src/vendor/phpunit/phpunit/phpunit:106
Logs generated by test
Show Details
15:10:21
15:10:21 41) ArticleViewTest::testHiddenViewOfDeletedRevision
15:10:21 CannotCreateActorException: Cannot create an actor for an IP user when temporary accounts are enabled
15:10:21
15:10:21 /workspace/src/includes/user/ActorStore.php:638
15:10:21 /workspace/src/includes/user/ActorStore.php:415
15:10:21 /workspace/src/includes/logging/ManualLogEntry.php:299
15:10:21 /workspace/src/includes/revisiondelete/RevDelList.php:389
15:10:21 /workspace/src/includes/revisiondelete/RevDelList.php:304
15:10:21 /workspace/src/tests/phpunit/includes/page/ArticleViewTest.php:460
15:10:21 phpvfscomposer:///workspace/src/vendor/phpunit/phpunit/phpunit:106
Logs generated by test
Show Details
15:10:21
15:10:21 42) PageArchiveTest::testUndeleteRevisions
15:10:21 CannotCreateActorException: Cannot create an actor for an IP user when temporary accounts are enabled
15:10:21
15:10:21 /workspace/src/includes/user/ActorStore.php:638
15:10:21 /workspace/src/includes/user/ActorStore.php:415
15:10:21 /workspace/src/includes/Revision/RevisionStore.php:891
15:10:21 /workspace/src/includes/Revision/RevisionStore.php:768
15:10:21 /workspace/src/includes/Revision/RevisionStore.php:634
15:10:21 /workspace/src/includes/Revision/RevisionStore.php:485
15:10:21 /workspace/src/includes/libs/rdbms/database/Database.php:2269
15:10:21 /workspace/src/includes/libs/rdbms/database/DBConnRef.php:127
15:10:21 /workspace/src/includes/libs/rdbms/database/DBConnRef.php:654
15:10:21 /workspace/src/includes/Revision/RevisionStore.php:493
15:10:21 /workspace/src/tests/phpunit/includes/page/PageArchiveTest.php:81
15:10:21 phpvfscomposer:///workspace/src/vendor/phpunit/phpunit/phpunit:106
Logs generated by test
Show Details
15:10:21
15:10:21 43) PageArchiveTest::testListPagesBySearch
15:10:21 CannotCreateActorException: Cannot create an actor for an IP user when temporary accounts are enabled
15:10:21
15:10:21 /workspace/src/includes/user/ActorStore.php:638
15:10:21 /workspace/src/includes/user/ActorStore.php:415
15:10:21 /workspace/src/includes/Revision/RevisionStore.php:891
15:10:21 /workspace/src/includes/Revision/RevisionStore.php:768
15:10:21 /workspace/src/includes/Revision/RevisionStore.php:634
15:10:21 /workspace/src/includes/Revision/RevisionStore.php:485
15:10:21 /workspace/src/includes/libs/rdbms/database/Database.php:2269
15:10:21 /workspace/src/includes/libs/rdbms/database/DBConnRef.php:127
15:10:21 /workspace/src/includes/libs/rdbms/database/DBConnRef.php:654
15:10:21 /workspace/src/includes/Revision/RevisionStore.php:493
15:10:21 /workspace/src/tests/phpunit/includes/page/PageArchiveTest.php:81
15:10:21 phpvfscomposer:///workspace/src/vendor/phpunit/phpunit/phpunit:106
Logs generated by test
Show Details
15:10:21
15:10:21 44) PageArchiveTest::testListPagesByPrefix
15:10:21 CannotCreateActorException: Cannot create an actor for an IP user when temporary accounts are enabled
15:10:21
15:10:21 /workspace/src/includes/user/ActorStore.php:638
15:10:21 /workspace/src/includes/user/ActorStore.php:415
15:10:21 /workspace/src/includes/Revision/RevisionStore.php:891
15:10:21 /workspace/src/includes/Revision/RevisionStore.php:768
15:10:21 /workspace/src/includes/Revision/RevisionStore.php:634
15:10:21 /workspace/src/includes/Revision/RevisionStore.php:485
15:10:21 /workspace/src/includes/libs/rdbms/database/Database.php:2269
15:10:21 /workspace/src/includes/libs/rdbms/database/DBConnRef.php:127
15:10:21 /workspace/src/includes/libs/rdbms/database/DBConnRef.php:654
15:10:21 /workspace/src/includes/Revision/RevisionStore.php:493
15:10:21 /workspace/src/tests/phpunit/includes/page/PageArchiveTest.php:81
15:10:21 phpvfscomposer:///workspace/src/vendor/phpunit/phpunit/phpunit:106
Logs generated by test
Show Details
15:10:21
15:10:21 45) PageArchiveTest::testValidCovers
15:10:21 CannotCreateActorException: Cannot create an actor for an IP user when temporary accounts are enabled
15:10:21
15:10:21 /workspace/src/includes/user/ActorStore.php:638
15:10:21 /workspace/src/includes/user/ActorStore.php:415
15:10:21 /workspace/src/includes/Revision/RevisionStore.php:891
15:10:21 /workspace/src/includes/Revision/RevisionStore.php:768
15:10:21 /workspace/src/includes/Revision/RevisionStore.php:634
15:10:21 /workspace/src/includes/Revision/RevisionStore.php:485
15:10:21 /workspace/src/includes/libs/rdbms/database/Database.php:2269
15:10:21 /workspace/src/includes/libs/rdbms/database/DBConnRef.php:127
15:10:21 /workspace/src/includes/libs/rdbms/database/DBConnRef.php:654
15:10:21 /workspace/src/includes/Revision/RevisionStore.php:493
15:10:21 /workspace/src/tests/phpunit/includes/page/PageArchiveTest.php:81
15:10:21 phpvfscomposer:///workspace/src/vendor/phpunit/phpunit/phpunit:106
Logs generated by test
Show Details
15:10:21
15:10:21 46) WikiPageDbTest::testGetAutoDeleteReason with data set #1 (array(array('first edit', null)), '/first edit.*only contributor/', false)
15:10:21 CannotCreateActorException: Cannot create an actor for an IP user when temporary accounts are enabled
15:10:21
15:10:21 /workspace/src/includes/user/ActorStore.php:638
15:10:21 /workspace/src/includes/user/ActorStore.php:415
15:10:21 /workspace/src/includes/Revision/RevisionStore.php:891
15:10:21 /workspace/src/includes/Revision/RevisionStore.php:768
15:10:21 /workspace/src/includes/Revision/RevisionStore.php:634
15:10:21 /workspace/src/includes/Revision/RevisionStore.php:485
15:10:21 /workspace/src/includes/libs/rdbms/database/Database.php:2269
15:10:21 /workspace/src/includes/libs/rdbms/database/DBConnRef.php:127
15:10:21 /workspace/src/includes/libs/rdbms/database/DBConnRef.php:654
15:10:21 /workspace/src/includes/Revision/RevisionStore.php:493
15:10:21 /workspace/src/includes/Storage/PageUpdater.php:1506
15:10:21 /workspace/src/includes/Storage/PageUpdater.php:925
15:10:21 /workspace/src/includes/page/WikiPage.php:1692
15:10:21 /workspace/src/tests/phpunit/includes/page/WikiPageDbTest.php:1150
15:10:21 phpvfscomposer:///workspace/src/vendor/phpunit/phpunit/phpunit:106
Logs generated by test
Show Details
15:10:21
15:10:21 47) WikiPageDbTest::testGetAutoDeleteReason with data set #2 (array(array('first edit', null), array('second edit', null)), '/second edit.*only contributor/', true)
15:10:21 CannotCreateActorException: Cannot create an actor for an IP user when temporary accounts are enabled
15:10:21
15:10:21 /workspace/src/includes/user/ActorStore.php:638
15:10:21 /workspace/src/includes/user/ActorStore.php:415
15:10:21 /workspace/src/includes/Revision/RevisionStore.php:891
15:10:21 /workspace/src/includes/Revision/RevisionStore.php:768
15:10:21 /workspace/src/includes/Revision/RevisionStore.php:634
15:10:21 /workspace/src/includes/Revision/RevisionStore.php:485
15:10:21 /workspace/src/includes/libs/rdbms/database/Database.php:2269
15:10:21 /workspace/src/includes/libs/rdbms/database/DBConnRef.php:127
15:10:21 /workspace/src/includes/libs/rdbms/database/DBConnRef.php:654
15:10:21 /workspace/src/includes/Revision/RevisionStore.php:493
15:10:21 /workspace/src/includes/Storage/PageUpdater.php:1506
15:10:21 /workspace/src/includes/Storage/PageUpdater.php:925
15:10:21 /workspace/src/includes/page/WikiPage.php:1692
15:10:21 /workspace/src/tests/phpunit/includes/page/WikiPageDbTest.php:1150
15:10:21 phpvfscomposer:///workspace/src/vendor/phpunit/phpunit/phpunit:106
Logs generated by test
Show Details
15:10:21
15:10:21 48) WikiPageDbTest::testGetAutoDeleteReason with data set #3 (array(array('first edit', '127.0.2.22'), array('second edit', '127.0.3.33')), '/second edit/', true)
15:10:21 CannotCreateActorException: Cannot create an actor for an IP user when temporary accounts are enabled
15:10:21
15:10:21 /workspace/src/includes/user/ActorStore.php:638
15:10:21 /workspace/src/includes/user/ActorStore.php:415
15:10:21 /workspace/src/includes/Revision/RevisionStore.php:891
15:10:21 /workspace/src/includes/Revision/RevisionStore.php:768
15:10:21 /workspace/src/includes/Revision/RevisionStore.php:634
15:10:21 /workspace/src/includes/Revision/RevisionStore.php:485
15:10:21 /workspace/src/includes/libs/rdbms/database/Database.php:2269
15:10:21 /workspace/src/includes/libs/rdbms/database/DBConnRef.php:127
15:10:21 /workspace/src/includes/libs/rdbms/database/DBConnRef.php:654
15:10:21 /workspace/src/includes/Revision/RevisionStore.php:493
15:10:21 /workspace/src/includes/Storage/PageUpdater.php:1506
15:10:21 /workspace/src/includes/Storage/PageUpdater.php:925
15:10:21 /workspace/src/includes/page/WikiPage.php:1692
15:10:21 /workspace/src/tests/phpunit/includes/page/WikiPageDbTest.php:1150
15:10:21 phpvfscomposer:///workspace/src/vendor/phpunit/phpunit/phpunit:106
Logs generated by test
Show Details
15:10:21
15:10:21 49) WikiPageDbTest::testGetAutoDeleteReason with data set #4 (array(array('first edit: Lorem ipsum dolor... amet'', null)), '/first edit:.*\.\.\."/', false)
15:10:21 CannotCreateActorException: Cannot create an actor for an IP user when temporary accounts are enabled
15:10:21
15:10:21 /workspace/src/includes/user/ActorStore.php:638
15:10:21 /workspace/src/includes/user/ActorStore.php:415
15:10:21 /workspace/src/includes/Revision/RevisionStore.php:891
15:10:21 /workspace/src/includes/Revision/RevisionStore.php:768
15:10:21 /workspace/src/includes/Revision/RevisionStore.php:634
15:10:21 /workspace/src/includes/Revision/RevisionStore.php:485
15:10:21 /workspace/src/includes/libs/rdbms/database/Database.php:2269
15:10:21 /workspace/src/includes/libs/rdbms/database/DBConnRef.php:127
15:10:21 /workspace/src/includes/libs/rdbms/database/DBConnRef.php:654
15:10:21 /workspace/src/includes/Revision/RevisionStore.php:493
15:10:21 /workspace/src/includes/Storage/PageUpdater.php:1506
15:10:21 /workspace/src/includes/Storage/PageUpdater.php:925
15:10:21 /workspace/src/includes/page/WikiPage.php:1692
15:10:21 /workspace/src/tests/phpunit/includes/page/WikiPageDbTest.php:1150
15:10:21 phpvfscomposer:///workspace/src/vendor/phpunit/phpunit/phpunit:106
Logs generated by test
Show Details
15:10:21
15:10:21 50) WikiPageDbTest::testGetAutoDeleteReason with data set #5 (array(array('first edit', '127.0.2.22'), array('', '127.0.3.33')), '/before blanking.*first edit/', true)
15:10:21 CannotCreateActorException: Cannot create an actor for an IP user when temporary accounts are enabled
15:10:21
15:10:21 /workspace/src/includes/user/ActorStore.php:638
15:10:21 /workspace/src/includes/user/ActorStore.php:415
15:10:21 /workspace/src/includes/Revision/RevisionStore.php:891
15:10:21 /workspace/src/includes/Revision/RevisionStore.php:768
15:10:21 /workspace/src/includes/Revision/RevisionStore.php:634
15:10:21 /workspace/src/includes/Revision/RevisionStore.php:485
15:10:21 /workspace/src/includes/libs/rdbms/database/Database.php:2269
15:10:21 /workspace/src/includes/libs/rdbms/database/DBConnRef.php:127
15:10:21 /workspace/src/includes/libs/rdbms/database/DBConnRef.php:654
15:10:21 /workspace/src/includes/Revision/RevisionStore.php:493
15:10:21 /workspace/src/includes/Storage/PageUpdater.php:1506
15:10:21 /workspace/src/includes/Storage/PageUpdater.php:925
15:10:21 /workspace/src/includes/page/WikiPage.php:1692
15:10:21 /workspace/src/tests/phpunit/includes/page/WikiPageDbTest.php:1150
15:10:21 phpvfscomposer:///workspace/src/vendor/phpunit/phpunit/phpunit:106
Logs generated by test
Show Details
15:10:21
15:10:21 51) SpecialLogTest::testSuppressionLog
15:10:21 CannotCreateActorException: Cannot create an actor for an IP user when temporary accounts are enabled
15:10:21
15:10:21 /workspace/src/includes/user/ActorStore.php:638
15:10:21 /workspace/src/includes/user/ActorStore.php:415
15:10:21 /workspace/src/includes/logging/ManualLogEntry.php:299
15:10:21 /workspace/src/includes/revisiondelete/RevDelList.php:389
15:10:21 /workspace/src/includes/revisiondelete/RevDelList.php:304
15:10:21 /workspace/src/tests/phpunit/includes/specials/SpecialLogTest.php:59
15:10:21 phpvfscomposer:///workspace/src/vendor/phpunit/phpunit/phpunit:106
Logs generated by test
Show Details
15:10:21
15:10:21 52) SpecialMyLanguageTest::testFindTitle with data set #0 (null, '::Fail', 'en', 'en')
15:10:21 CannotCreateActorException: Cannot create an actor for an IP user when temporary accounts are enabled
15:10:21
15:10:21 /workspace/src/includes/user/ActorStore.php:638
15:10:21 /workspace/src/includes/user/ActorStore.php:415
15:10:21 /workspace/src/includes/logging/ManualLogEntry.php:299
15:10:21 /workspace/src/includes/specials/SpecialPageLanguage.php:299
15:10:21 /workspace/src/tests/phpunit/includes/specials/SpecialMyLanguageTest.php:45
15:10:21 /workspace/src/tests/phpunit/MediaWikiIntegrationTestCase.php:697
15:10:21 /workspace/src/tests/phpunit/MediaWikiIntegrationTestCase.php:632
15:10:21 phpvfscomposer:///workspace/src/vendor/phpunit/phpunit/phpunit:106
Logs generated by test
Show Details
15:10:21
15:10:21 53) SpecialRecentChangesTest::testExperienceLevelFilter
15:10:21 CannotCreateActorException: Cannot create an actor for an IP user when temporary accounts are enabled
15:10:21
15:10:21 /workspace/src/includes/user/ActorStore.php:638
15:10:21 /workspace/src/includes/user/ActorStore.php:415
15:10:21 /workspace/src/includes/Revision/RevisionStore.php:891
15:10:21 /workspace/src/includes/Revision/RevisionStore.php:768
15:10:21 /workspace/src/includes/Revision/RevisionStore.php:634
15:10:21 /workspace/src/includes/Revision/RevisionStore.php:485
15:10:21 /workspace/src/includes/libs/rdbms/database/Database.php:2269
15:10:21 /workspace/src/includes/libs/rdbms/database/DBConnRef.php:127
15:10:21 /workspace/src/includes/libs/rdbms/database/DBConnRef.php:654
15:10:21 /workspace/src/includes/Revision/RevisionStore.php:493
15:10:21 /workspace/src/includes/Storage/PageUpdater.php:1375
15:10:21 /workspace/src/includes/Storage/PageUpdater.php:923
15:10:21 /workspace/src/includes/page/WikiPage.php:1692
15:10:21 /workspace/src/tests/phpunit/MediaWikiIntegrationTestCase.php:2645
15:10:21 /workspace/src/tests/phpunit/includes/specials/SpecialRecentChangesTest.php:131
15:10:21 phpvfscomposer:///workspace/src/vendor/phpunit/phpunit/phpunit:106
Logs generated by test
Show Details
15:10:21
15:10:21 54) TemplateCategoriesTest::testTemplateCategories
15:10:21 CannotCreateActorException: Cannot create an actor for an IP user when temporary accounts are enabled
15:10:21
15:10:21 /workspace/src/includes/user/ActorStore.php:638
15:10:21 /workspace/src/includes/user/ActorStore.php:415
15:10:21 /workspace/src/includes/Revision/RevisionStore.php:891
15:10:21 /workspace/src/includes/Revision/RevisionStore.php:768
15:10:21 /workspace/src/includes/Revision/RevisionStore.php:634
15:10:21 /workspace/src/includes/Revision/RevisionStore.php:485
15:10:21 /workspace/src/includes/libs/rdbms/database/Database.php:2269
15:10:21 /workspace/src/includes/libs/rdbms/database/DBConnRef.php:127
15:10:21 /workspace/src/includes/libs/rdbms/database/DBConnRef.php:654
15:10:21 /workspace/src/includes/Revision/RevisionStore.php:493
15:10:21 /workspace/src/includes/Storage/PageUpdater.php:1506
15:10:21 /workspace/src/includes/Storage/PageUpdater.php:925
15:10:21 /workspace/src/includes/page/WikiPage.php:1692
15:10:21 /workspace/src/tests/phpunit/includes/title/TemplateCategoriesTest.php:32
15:10:21 phpvfscomposer:///workspace/src/vendor/phpunit/phpunit/phpunit:106
Logs generated by test
Show Details
15:10:21
15:10:21 55) UserEditTrackerTest::testGetEditTimestamp_anon
15:10:21 CannotCreateActorException: Cannot create an actor for an IP user when temporary accounts are enabled
15:10:21
15:10:21 /workspace/src/includes/user/ActorStore.php:638
15:10:21 /workspace/src/includes/user/ActorStore.php:415
15:10:21 /workspace/src/includes/Revision/RevisionStore.php:891
15:10:21 /workspace/src/includes/Revision/RevisionStore.php:768
15:10:21 /workspace/src/includes/Revision/RevisionStore.php:634
15:10:21 /workspace/src/includes/Revision/RevisionStore.php:485
15:10:21 /workspace/src/includes/libs/rdbms/database/Database.php:2269
15:10:21 /workspace/src/includes/Revision/RevisionStore.php:493
15:10:21 /workspace/src/tests/phpunit/includes/user/UserEditTrackerTest.php:38
15:10:21 /workspace/src/tests/phpunit/includes/user/UserEditTrackerTest.php:115
15:10:21 phpvfscomposer:///workspace/src/vendor/phpunit/phpunit/phpunit:106
Logs generated by test
Show Details
15:10:21
15:10:21 56) UserTest::testActorId
15:10:21 CannotCreateActorException: Cannot create an actor for an IP user when temporary accounts are enabled
15:10:21
15:10:21 /workspace/src/includes/user/ActorStore.php:638
15:10:21 /workspace/src/includes/user/ActorStore.php:415
15:10:21 /workspace/src/includes/user/User.php:1645
15:10:21 /workspace/src/tests/phpunit/includes/user/UserTest.php:742
15:10:21 phpvfscomposer:///workspace/src/vendor/phpunit/phpunit/phpunit:106
Logs generated by test
Show Details
15:10:21
15:10:21 57) UserTest::testNewFromAnyId
15:10:21 CannotCreateActorException: Cannot create an actor for an IP user when temporary accounts are enabled
15:10:21
15:10:21 /workspace/src/includes/user/ActorStore.php:638
15:10:21 /workspace/src/includes/user/ActorStore.php:415
15:10:21 /workspace/src/tests/phpunit/includes/user/UserTest.php:805
15:10:21 phpvfscomposer:///workspace/src/vendor/phpunit/phpunit/phpunit:106
Logs generated by test
Show Details
15:10:21
15:10:21 58) MediaWiki\Tests\Maintenance\BackupDumperPageTest::testFullTextPlain with data set #0 ('0.10')
15:10:21 Error: Typed property MediaWiki\Tests\Maintenance\BackupDumperPageTest::$pageId3 must not be accessed before initialization
15:10:21
15:10:21 /workspace/src/tests/phpunit/maintenance/PageDumpTestDataTrait.php:151
15:10:21 /workspace/src/tests/phpunit/maintenance/BackupDumperPageTest.php:36
15:10:21 /workspace/src/tests/phpunit/MediaWikiIntegrationTestCase.php:703
15:10:21 /workspace/src/tests/phpunit/MediaWikiIntegrationTestCase.php:632
15:10:21 phpvfscomposer:///workspace/src/vendor/phpunit/phpunit/phpunit:106
Logs generated by test
Show Details
15:10:21
15:10:21 59) MediaWiki\Tests\Maintenance\BackupDumperPageTest::testFullTextPlain with data set #1 ('0.11')
15:10:21 Error: Typed property MediaWiki\Tests\Maintenance\BackupDumperPageTest::$pageId3 must not be accessed before initialization
15:10:21
15:10:21 /workspace/src/tests/phpunit/maintenance/PageDumpTestDataTrait.php:151
15:10:21 /workspace/src/tests/phpunit/maintenance/BackupDumperPageTest.php:36
15:10:21 /workspace/src/tests/phpunit/MediaWikiIntegrationTestCase.php:703
15:10:21 /workspace/src/tests/phpunit/MediaWikiIntegrationTestCase.php:632
15:10:21 phpvfscomposer:///workspace/src/vendor/phpunit/phpunit/phpunit:106
Logs generated by test
Show Details
15:10:21
15:10:21 60) MediaWiki\Tests\Maintenance\BackupDumperPageTest::testFullStubPlain with data set #0 ('0.10')
15:10:21 Error: Typed property MediaWiki\Tests\Maintenance\BackupDumperPageTest::$pageId3 must not be accessed before initialization
15:10:21
15:10:21 /workspace/src/tests/phpunit/maintenance/PageDumpTestDataTrait.php:151
15:10:21 /workspace/src/tests/phpunit/maintenance/BackupDumperPageTest.php:36
15:10:21 /workspace/src/tests/phpunit/MediaWikiIntegrationTestCase.php:703
15:10:21 /workspace/src/tests/phpunit/MediaWikiIntegrationTestCase.php:632
15:10:21 phpvfscomposer:///workspace/src/vendor/phpunit/phpunit/phpunit:106
Logs generated by test
Show Details
15:10:21
15:10:21 61) MediaWiki\Tests\Maintenance\BackupDumperPageTest::testFullStubPlain with data set #1 ('0.11')
15:10:21 Error: Typed property MediaWiki\Tests\Maintenance\BackupDumperPageTest::$pageId3 must not be accessed before initialization
15:10:21
15:10:21 /workspace/src/tests/phpunit/maintenance/PageDumpTestDataTrait.php:151
15:10:21 /workspace/src/tests/phpunit/maintenance/BackupDumperPageTest.php:36
15:10:21 /workspace/src/tests/phpunit/MediaWikiIntegrationTestCase.php:703
15:10:21 /workspace/src/tests/phpunit/MediaWikiIntegrationTestCase.php:632
15:10:21 phpvfscomposer:///workspace/src/vendor/phpunit/phpunit/phpunit:106
Logs generated by test
Show Details
15:10:21
15:10:21 62) MediaWiki\Tests\Maintenance\BackupDumperPageTest::testCurrentStubPlain with data set #0 ('0.10')
15:10:21 Error: Typed property MediaWiki\Tests\Maintenance\BackupDumperPageTest::$pageId3 must not be accessed before initialization
15:10:21
15:10:21 /workspace/src/tests/phpunit/maintenance/PageDumpTestDataTrait.php:151
15:10:21 /workspace/src/tests/phpunit/maintenance/BackupDumperPageTest.php:36
15:10:21 /workspace/src/tests/phpunit/MediaWikiIntegrationTestCase.php:703
15:10:21 /workspace/src/tests/phpunit/MediaWikiIntegrationTestCase.php:632
15:10:21 phpvfscomposer:///workspace/src/vendor/phpunit/phpunit/phpunit:106
Logs generated by test
Show Details
15:10:21
15:10:21 63) MediaWiki\Tests\Maintenance\BackupDumperPageTest::testCurrentStubPlain with data set #1 ('0.11')
15:10:21 Error: Typed property MediaWiki\Tests\Maintenance\BackupDumperPageTest::$pageId3 must not be accessed before initialization
15:10:21
15:10:21 /workspace/src/tests/phpunit/maintenance/PageDumpTestDataTrait.php:151
15:10:21 /workspace/src/tests/phpunit/maintenance/BackupDumperPageTest.php:36
15:10:21 /workspace/src/tests/phpunit/MediaWikiIntegrationTestCase.php:703
15:10:21 /workspace/src/tests/phpunit/MediaWikiIntegrationTestCase.php:632
15:10:21 phpvfscomposer:///workspace/src/vendor/phpunit/phpunit/phpunit:106
Logs generated by test
Show Details
15:10:21
15:10:21 64) MediaWiki\Tests\Maintenance\BackupDumperPageTest::testCurrentStubGzip
15:10:21 Error: Typed property MediaWiki\Tests\Maintenance\BackupDumperPageTest::$pageId3 must not be accessed before initialization
15:10:21
15:10:21 /workspace/src/tests/phpunit/maintenance/PageDumpTestDataTrait.php:151
15:10:21 /workspace/src/tests/phpunit/maintenance/BackupDumperPageTest.php:36
15:10:21 /workspace/src/tests/phpunit/MediaWikiIntegrationTestCase.php:703
15:10:21 /workspace/src/tests/phpunit/MediaWikiIntegrationTestCase.php:632
15:10:21 phpvfscomposer:///workspace/src/vendor/phpunit/phpunit/phpunit:106
Logs generated by test
Show Details
15:10:21
15:10:21 65) MediaWiki\Tests\Maintenance\BackupDumperPageTest::testXmlDumpsBackupUseCase with data set #0 ('0.10')
15:10:21 Error: Typed property MediaWiki\Tests\Maintenance\BackupDumperPageTest::$pageId3 must not be accessed before initialization
15:10:21
15:10:21 /workspace/src/tests/phpunit/maintenance/PageDumpTestDataTrait.php:151
15:10:21 /workspace/src/tests/phpunit/maintenance/BackupDumperPageTest.php:36
15:10:21 /workspace/src/tests/phpunit/MediaWikiIntegrationTestCase.php:703
15:10:21 /workspace/src/tests/phpunit/MediaWikiIntegrationTestCase.php:632
15:10:21 phpvfscomposer:///workspace/src/vendor/phpunit/phpunit/phpunit:106
Logs generated by test
Show Details
15:10:21
15:10:21 66) MediaWiki\Tests\Maintenance\BackupDumperPageTest::testXmlDumpsBackupUseCase with data set #1 ('0.11')
15:10:21 Error: Typed property MediaWiki\Tests\Maintenance\BackupDumperPageTest::$pageId3 must not be accessed before initialization
15:10:21
15:10:21 /workspace/src/tests/phpunit/maintenance/PageDumpTestDataTrait.php:151
15:10:21 /workspace/src/tests/phpunit/maintenance/BackupDumperPageTest.php:36
15:10:21 /workspace/src/tests/phpunit/MediaWikiIntegrationTestCase.php:703
15:10:21 /workspace/src/tests/phpunit/MediaWikiIntegrationTestCase.php:632
15:10:21 phpvfscomposer:///workspace/src/vendor/phpunit/phpunit/phpunit:106
Logs generated by test
Show Details
15:10:21
15:10:21 67) MediaWiki\Tests\Maintenance\BackupDumperPageTest::testValidCovers
15:10:21 Error: Typed property MediaWiki\Tests\Maintenance\BackupDumperPageTest::$pageId3 must not be accessed before initialization
15:10:21
15:10:21 /workspace/src/tests/phpunit/maintenance/PageDumpTestDataTrait.php:151
15:10:21 /workspace/src/tests/phpunit/maintenance/BackupDumperPageTest.php:36
15:10:21 /workspace/src/tests/phpunit/MediaWikiIntegrationTestCase.php:703
15:10:21 /workspace/src/tests/phpunit/MediaWikiIntegrationTestCase.php:632
15:10:21 phpvfscomposer:///workspace/src/vendor/phpunit/phpunit/phpunit:106
Logs generated by test
Show Details
15:10:21
15:10:21 68) MediaWiki\Tests\Maintenance\TextPassDumperDatabaseTest::testFullTextPlain with data set #0 ('0.10')
15:10:21 Error: Typed property MediaWiki\Tests\Maintenance\TextPassDumperDatabaseTest::$pageId3 must not be accessed before initialization
15:10:21
15:10:21 /workspace/src/tests/phpunit/maintenance/PageDumpTestDataTrait.php:151
15:10:21 /workspace/src/tests/phpunit/maintenance/TextPassDumperDatabaseTest.php:32
15:10:21 /workspace/src/tests/phpunit/MediaWikiIntegrationTestCase.php:703
15:10:21 /workspace/src/tests/phpunit/MediaWikiIntegrationTestCase.php:632
15:10:21 phpvfscomposer:///workspace/src/vendor/phpunit/phpunit/phpunit:106
Logs generated by test
Show Details
15:10:21
15:10:21 69) MediaWiki\Tests\Maintenance\TextPassDumperDatabaseTest::testFullTextPlain with data set #1 ('0.11')
15:10:21 Error: Typed property MediaWiki\Tests\Maintenance\TextPassDumperDatabaseTest::$pageId3 must not be accessed before initialization
15:10:21
15:10:21 /workspace/src/tests/phpunit/maintenance/PageDumpTestDataTrait.php:151
15:10:21 /workspace/src/tests/phpunit/maintenance/TextPassDumperDatabaseTest.php:32
15:10:21 /workspace/src/tests/phpunit/MediaWikiIntegrationTestCase.php:703
15:10:21 /workspace/src/tests/phpunit/MediaWikiIntegrationTestCase.php:632
15:10:21 phpvfscomposer:///workspace/src/vendor/phpunit/phpunit/phpunit:106
Logs generated by test
Show Details
15:10:21
15:10:21 70) MediaWiki\Tests\Maintenance\TextPassDumperDatabaseTest::testPrefetchPlain
15:10:21 Error: Typed property MediaWiki\Tests\Maintenance\TextPassDumperDatabaseTest::$pageId3 must not be accessed before initialization
15:10:21
15:10:21 /workspace/src/tests/phpunit/maintenance/PageDumpTestDataTrait.php:151
15:10:21 /workspace/src/tests/phpunit/maintenance/TextPassDumperDatabaseTest.php:32
15:10:21 /workspace/src/tests/phpunit/MediaWikiIntegrationTestCase.php:703
15:10:21 /workspace/src/tests/phpunit/MediaWikiIntegrationTestCase.php:632
15:10:21 phpvfscomposer:///workspace/src/vendor/phpunit/phpunit/phpunit:106
Logs generated by test
Show Details
15:10:21
15:10:21 71) MediaWiki\Tests\Maintenance\TextPassDumperDatabaseTest::testValidCovers
15:10:21 Error: Typed property MediaWiki\Tests\Maintenance\TextPassDumperDatabaseTest::$pageId3 must not be accessed before initialization
15:10:21
15:10:21 /workspace/src/tests/phpunit/maintenance/PageDumpTestDataTrait.php:151
15:10:21 /workspace/src/tests/phpunit/maintenance/TextPassDumperDatabaseTest.php:32
15:10:21 /workspace/src/tests/phpunit/MediaWikiIntegrationTestCase.php:703
15:10:21 /workspace/src/tests/phpunit/MediaWikiIntegrationTestCase.php:632
15:10:21 phpvfscomposer:///workspace/src/vendor/phpunit/phpunit/phpunit:106
Logs generated by test
Show Details
15:10:22
15:10:22 72) MediaWiki\Tests\Storage\UndoIntegrationTest::testEditPage with data set "undoing a single revision" (array('1', '2'), '1', 0, 1, true, 1, 1, 0)
15:10:22 CannotCreateActorException: Cannot create an actor for an IP user when temporary accounts are enabled
15:10:22
15:10:22 /workspace/src/includes/user/ActorStore.php:638
15:10:22 /workspace/src/includes/user/ActorStore.php:415
15:10:22 /workspace/src/includes/Revision/RevisionStore.php:891
15:10:22 /workspace/src/includes/Revision/RevisionStore.php:768
15:10:22 /workspace/src/includes/Revision/RevisionStore.php:634
15:10:22 /workspace/src/includes/Revision/RevisionStore.php:485
15:10:22 /workspace/src/includes/libs/rdbms/database/Database.php:2269
15:10:22 /workspace/src/includes/libs/rdbms/database/DBConnRef.php:127
15:10:22 /workspace/src/includes/libs/rdbms/database/DBConnRef.php:654
15:10:22 /workspace/src/includes/Revision/RevisionStore.php:493
15:10:22 /workspace/src/includes/Storage/PageUpdater.php:1375
15:10:22 /workspace/src/includes/Storage/PageUpdater.php:923
15:10:22 /workspace/src/includes/editpage/EditPage.php:2505
15:10:22 /workspace/src/tests/phpunit/integration/includes/Storage/UndoIntegrationTest.php:437
15:10:22 phpvfscomposer:///workspace/src/vendor/phpunit/phpunit/phpunit:106
Logs generated by test
Show Details
15:10:22
15:10:22 73) MediaWiki\Tests\Storage\UndoIntegrationTest::testEditPage with data set "undoing multiple revisions" (array('1', '2', '3', '4'), '1', 0, 3, true, 1, 3, 0)
15:10:22 CannotCreateActorException: Cannot create an actor for an IP user when temporary accounts are enabled
15:10:22
15:10:22 /workspace/src/includes/user/ActorStore.php:638
15:10:22 /workspace/src/includes/user/ActorStore.php:415
15:10:22 /workspace/src/includes/Revision/RevisionStore.php:891
15:10:22 /workspace/src/includes/Revision/RevisionStore.php:768
15:10:22 /workspace/src/includes/Revision/RevisionStore.php:634
15:10:22 /workspace/src/includes/Revision/RevisionStore.php:485
15:10:22 /workspace/src/includes/libs/rdbms/database/Database.php:2269
15:10:22 /workspace/src/includes/libs/rdbms/database/DBConnRef.php:127
15:10:22 /workspace/src/includes/libs/rdbms/database/DBConnRef.php:654
15:10:22 /workspace/src/includes/Revision/RevisionStore.php:493
15:10:22 /workspace/src/includes/Storage/PageUpdater.php:1375
15:10:22 /workspace/src/includes/Storage/PageUpdater.php:923
15:10:22 /workspace/src/includes/editpage/EditPage.php:2505
15:10:22 /workspace/src/tests/phpunit/integration/includes/Storage/UndoIntegrationTest.php:437
15:10:22 phpvfscomposer:///workspace/src/vendor/phpunit/phpunit/phpunit:106
Logs generated by test
Show Details
15:10:22
15:10:22 74) MediaWiki\Tests\Storage\UndoIntegrationTest::testEditPage with data set "undoing an intermittent revision" (array('line 1\n\nline 2\n\nline3', 'line 1\n\nvandalism\n\nline3', 'line 1\n\nvandalism\n\nline3 ...ontent'), 'line 1\n\nline 2\n\nline3 more content', 0, 1, false, 1, 1, 'false')
15:10:22 CannotCreateActorException: Cannot create an actor for an IP user when temporary accounts are enabled
15:10:22
15:10:22 /workspace/src/includes/user/ActorStore.php:638
15:10:22 /workspace/src/includes/user/ActorStore.php:415
15:10:22 /workspace/src/includes/Revision/RevisionStore.php:891
15:10:22 /workspace/src/includes/Revision/RevisionStore.php:768
15:10:22 /workspace/src/includes/Revision/RevisionStore.php:634
15:10:22 /workspace/src/includes/Revision/RevisionStore.php:485
15:10:22 /workspace/src/includes/libs/rdbms/database/Database.php:2269
15:10:22 /workspace/src/includes/libs/rdbms/database/DBConnRef.php:127
15:10:22 /workspace/src/includes/libs/rdbms/database/DBConnRef.php:654
15:10:22 /workspace/src/includes/Revision/RevisionStore.php:493
15:10:22 /workspace/src/includes/Storage/PageUpdater.php:1375
15:10:22 /workspace/src/includes/Storage/PageUpdater.php:923
15:10:22 /workspace/src/includes/editpage/EditPage.php:2505
15:10:22 /workspace/src/tests/phpunit/integration/includes/Storage/UndoIntegrationTest.php:437
15:10:22 phpvfscomposer:///workspace/src/vendor/phpunit/phpunit/phpunit:106
Logs generated by test
Show Details
15:10:22
15:10:22 75) MediaWiki\Tests\Storage\UndoIntegrationTest::testEditPage with data set "undoing multiple intermittent revisions" (array('line 1\n\nline 2\n\nline3', 'line 1\n\nvandalism\n\nline3', 'line 1\n\nmore vandalism\n\nline3', 'line 1\n\nmore vandalism\n\nl...ontent'), 'line 1\n\nline 2\n\nline3 content', 0, 2, false, 1, 2, 'false')
15:10:22 CannotCreateActorException: Cannot create an actor for an IP user when temporary accounts are enabled
15:10:22
15:10:22 /workspace/src/includes/user/ActorStore.php:638
15:10:22 /workspace/src/includes/user/ActorStore.php:415
15:10:22 /workspace/src/includes/Revision/RevisionStore.php:891
15:10:22 /workspace/src/includes/Revision/RevisionStore.php:768
15:10:22 /workspace/src/includes/Revision/RevisionStore.php:634
15:10:22 /workspace/src/includes/Revision/RevisionStore.php:485
15:10:22 /workspace/src/includes/libs/rdbms/database/Database.php:2269
15:10:22 /workspace/src/includes/libs/rdbms/database/DBConnRef.php:127
15:10:22 /workspace/src/includes/libs/rdbms/database/DBConnRef.php:654
15:10:22 /workspace/src/includes/Revision/RevisionStore.php:493
15:10:22 /workspace/src/includes/Storage/PageUpdater.php:1375
15:10:22 /workspace/src/includes/Storage/PageUpdater.php:923
15:10:22 /workspace/src/includes/editpage/EditPage.php:2505
15:10:22 /workspace/src/tests/phpunit/integration/includes/Storage/UndoIntegrationTest.php:437
15:10:22 phpvfscomposer:///workspace/src/vendor/phpunit/phpunit/phpunit:106
Logs generated by test
Show Details
15:10:22
15:10:22 76) MediaWiki\Tests\Storage\UndoIntegrationTest::testEditPage with data set "undoing a revision without undoafter param" (array('1', '2'), '1', 'false', 1, true, 1, 1, 0)
15:10:22 CannotCreateActorException: Cannot create an actor for an IP user when temporary accounts are enabled
15:10:22
15:10:22 /workspace/src/includes/user/ActorStore.php:638
15:10:22 /workspace/src/includes/user/ActorStore.php:415
15:10:22 /workspace/src/includes/Revision/RevisionStore.php:891
15:10:22 /workspace/src/includes/Revision/RevisionStore.php:768
15:10:22 /workspace/src/includes/Revision/RevisionStore.php:634
15:10:22 /workspace/src/includes/Revision/RevisionStore.php:485
15:10:22 /workspace/src/includes/libs/rdbms/database/Database.php:2269
15:10:22 /workspace/src/includes/libs/rdbms/database/DBConnRef.php:127
15:10:22 /workspace/src/includes/libs/rdbms/database/DBConnRef.php:654
15:10:22 /workspace/src/includes/Revision/RevisionStore.php:493
15:10:22 /workspace/src/includes/Storage/PageUpdater.php:1375
15:10:22 /workspace/src/includes/Storage/PageUpdater.php:923
15:10:22 /workspace/src/includes/editpage/EditPage.php:2505
15:10:22 /workspace/src/tests/phpunit/integration/includes/Storage/UndoIntegrationTest.php:437
15:10:22 phpvfscomposer:///workspace/src/vendor/phpunit/phpunit/phpunit:106
Logs generated by test
Show Details
15:10:22
15:10:22 77) MediaWiki\Tests\Storage\UndoIntegrationTest::testEditPage with data set "undoing an intermittent revision without undoafter param" (array('line 1\n\nline 2\n\nline3', 'line 1\n\nvandalism\n\nline3', 'line 1\n\nvandalism\n\nline3 ...ontent'), 'line 1\n\nline 2\n\nline3 more content', 'false', 1, false, 1, 1, 'false')
15:10:22 CannotCreateActorException: Cannot create an actor for an IP user when temporary accounts are enabled
15:10:22
15:10:22 /workspace/src/includes/user/ActorStore.php:638
15:10:22 /workspace/src/includes/user/ActorStore.php:415
15:10:22 /workspace/src/includes/Revision/RevisionStore.php:891
15:10:22 /workspace/src/includes/Revision/RevisionStore.php:768
15:10:22 /workspace/src/includes/Revision/RevisionStore.php:634
15:10:22 /workspace/src/includes/Revision/RevisionStore.php:485
15:10:22 /workspace/src/includes/libs/rdbms/database/Database.php:2269
15:10:22 /workspace/src/includes/libs/rdbms/database/DBConnRef.php:127
15:10:22 /workspace/src/includes/libs/rdbms/database/DBConnRef.php:654
15:10:22 /workspace/src/includes/Revision/RevisionStore.php:493
15:10:22 /workspace/src/includes/Storage/PageUpdater.php:1375
15:10:22 /workspace/src/includes/Storage/PageUpdater.php:923
15:10:22 /workspace/src/includes/editpage/EditPage.php:2505
15:10:22 /workspace/src/tests/phpunit/integration/includes/Storage/UndoIntegrationTest.php:437
15:10:22 phpvfscomposer:///workspace/src/vendor/phpunit/phpunit/phpunit:106
Logs generated by test
Show Details
15:10:22
15:10:22 78) MediaWiki\Tests\Storage\UndoIntegrationTest::testDirtyUndo
15:10:22 CannotCreateActorException: Cannot create an actor for an IP user when temporary accounts are enabled
15:10:22
15:10:22 /workspace/src/includes/user/ActorStore.php:638
15:10:22 /workspace/src/includes/user/ActorStore.php:415
15:10:22 /workspace/src/includes/Revision/RevisionStore.php:891
15:10:22 /workspace/src/includes/Revision/RevisionStore.php:768
15:10:22 /workspace/src/includes/Revision/RevisionStore.php:634
15:10:22 /workspace/src/includes/Revision/RevisionStore.php:485
15:10:22 /workspace/src/includes/libs/rdbms/database/Database.php:2269
15:10:22 /workspace/src/includes/libs/rdbms/database/DBConnRef.php:127
15:10:22 /workspace/src/includes/libs/rdbms/database/DBConnRef.php:654
15:10:22 /workspace/src/includes/Revision/RevisionStore.php:493
15:10:22 /workspace/src/includes/Storage/PageUpdater.php:1375
15:10:22 /workspace/src/includes/Storage/PageUpdater.php:923
15:10:22 /workspace/src/includes/editpage/EditPage.php:2505
15:10:22 /workspace/src/tests/phpunit/integration/includes/Storage/UndoIntegrationTest.php:489
15:10:22 phpvfscomposer:///workspace/src/vendor/phpunit/phpunit/phpunit:106
Logs generated by test
Show Details
15:10:22
15:10:22 79) BlockUserTest::testValidTarget
15:10:22 CannotCreateActorException: Cannot create an actor for an IP user when temporary accounts are enabled
15:10:22
15:10:22 /workspace/src/includes/user/ActorStore.php:638
15:10:22 /workspace/src/includes/user/ActorStore.php:415
15:10:22 /workspace/src/includes/block/DatabaseBlockStore.php:1399
15:10:22 /workspace/src/includes/block/DatabaseBlockStore.php:1049
15:10:22 /workspace/src/includes/block/DatabaseBlockStore.php:1000
15:10:22 /workspace/src/includes/block/BlockUser.php:596
15:10:22 /workspace/src/includes/block/BlockUser.php:533
15:10:22 /workspace/src/includes/block/BlockUser.php:459
15:10:22 /workspace/src/tests/phpunit/integration/includes/block/BlockUserTest.php:41
15:10:22 phpvfscomposer:///workspace/src/vendor/phpunit/phpunit/phpunit:106
Logs generated by test
Show Details
15:10:22
15:10:22 80) BlockUserTest::testReblock
15:10:22 CannotCreateActorException: Cannot create an actor for an IP user when temporary accounts are enabled
15:10:22
15:10:22 /workspace/src/includes/user/ActorStore.php:638
15:10:22 /workspace/src/includes/user/ActorStore.php:415
15:10:22 /workspace/src/includes/block/DatabaseBlockStore.php:1399
15:10:22 /workspace/src/includes/block/DatabaseBlockStore.php:1049
15:10:22 /workspace/src/includes/block/DatabaseBlockStore.php:1000
15:10:22 /workspace/src/includes/block/BlockUser.php:596
15:10:22 /workspace/src/includes/block/BlockUser.php:533
15:10:22 /workspace/src/tests/phpunit/integration/includes/block/BlockUserTest.php:120
15:10:22 phpvfscomposer:///workspace/src/vendor/phpunit/phpunit/phpunit:106
Logs generated by test
Show Details
15:10:22
15:10:22 81) BlockUserTest::testPostHook
15:10:22 CannotCreateActorException: Cannot create an actor for an IP user when temporary accounts are enabled
15:10:22
15:10:22 /workspace/src/includes/user/ActorStore.php:638
15:10:22 /workspace/src/includes/user/ActorStore.php:415
15:10:22 /workspace/src/includes/block/DatabaseBlockStore.php:1399
15:10:22 /workspace/src/includes/block/DatabaseBlockStore.php:1049
15:10:22 /workspace/src/includes/block/DatabaseBlockStore.php:1000
15:10:22 /workspace/src/includes/block/BlockUser.php:596
15:10:22 /workspace/src/includes/block/BlockUser.php:533
15:10:22 /workspace/src/tests/phpunit/integration/includes/block/BlockUserTest.php:176
15:10:22 phpvfscomposer:///workspace/src/vendor/phpunit/phpunit/phpunit:106
Logs generated by test
Show Details
15:10:22
15:10:22 82) BlockUserTest::testIPBlockAllowedAutoblockPreserved
15:10:22 CannotCreateActorException: Cannot create an actor for an IP user when temporary accounts are enabled
15:10:22
15:10:22 /workspace/src/includes/user/ActorStore.php:638
15:10:22 /workspace/src/includes/user/ActorStore.php:415
15:10:22 /workspace/src/includes/block/DatabaseBlockStore.php:1399
15:10:22 /workspace/src/includes/block/DatabaseBlockStore.php:1049
15:10:22 /workspace/src/includes/block/DatabaseBlockStore.php:1000
15:10:22 /workspace/src/includes/block/BlockUser.php:596
15:10:22 /workspace/src/includes/block/BlockUser.php:533
15:10:22 /workspace/src/tests/phpunit/integration/includes/block/BlockUserTest.php:210
15:10:22 phpvfscomposer:///workspace/src/vendor/phpunit/phpunit/phpunit:106
Logs generated by test
Show Details
15:10:22
15:10:22 83) MediaWiki\Tests\Block\UnblockUserTest::testValidUnblock
15:10:22 CannotCreateActorException: Cannot create an actor for an IP user when temporary accounts are enabled
15:10:22
15:10:22 /workspace/src/includes/user/ActorStore.php:638
15:10:22 /workspace/src/includes/user/ActorStore.php:415
15:10:22 /workspace/src/includes/block/DatabaseBlockStore.php:1399
15:10:22 /workspace/src/includes/block/DatabaseBlockStore.php:1049
15:10:22 /workspace/src/includes/block/DatabaseBlockStore.php:1000
15:10:22 /workspace/src/tests/phpunit/integration/includes/block/UnblockUserTest.php:47
15:10:22 phpvfscomposer:///workspace/src/vendor/phpunit/phpunit/phpunit:106
Logs generated by test
Show Details
15:10:22
15:10:22 84) MediaWiki\Tests\Log\LogPageTest::testAddEntrySetsProperties
15:10:22 CannotCreateActorException: Cannot create an actor for an IP user when temporary accounts are enabled
15:10:22
15:10:22 /workspace/src/includes/user/ActorStore.php:638
15:10:22 /workspace/src/includes/user/ActorStore.php:415
15:10:22 /workspace/src/includes/logging/LogPage.php:112
15:10:22 /workspace/src/includes/logging/LogPage.php:382
15:10:22 /workspace/src/tests/phpunit/integration/includes/logging/LogPageTest.php:59
15:10:22 phpvfscomposer:///workspace/src/vendor/phpunit/phpunit/phpunit:106
Logs generated by test
Show Details
15:10:22
15:10:22 85) MediaWiki\Tests\Log\LogPageTest::testAddEntrySave
15:10:22 CannotCreateActorException: Cannot create an actor for an IP user when temporary accounts are enabled
15:10:22
15:10:22 /workspace/src/includes/user/ActorStore.php:638
15:10:22 /workspace/src/includes/user/ActorStore.php:415
15:10:22 /workspace/src/includes/logging/LogPage.php:112
15:10:22 /workspace/src/includes/logging/LogPage.php:382
15:10:22 /workspace/src/tests/phpunit/integration/includes/logging/LogPageTest.php:78
15:10:22 phpvfscomposer:///workspace/src/vendor/phpunit/phpunit/phpunit:106
Logs generated by test
Show Details
15:10:22
15:10:22 86) MediaWiki\Tests\User\ActorStoreTest::testSequentialCacheRetrieval with data set #1 (MediaWiki\User\UserIdentityValue Object (...))
15:10:22 CannotCreateActorException: Cannot create an actor for an IP user when temporary accounts are enabled
15:10:22
15:10:22 /workspace/src/includes/user/ActorStore.php:638
15:10:22 /workspace/src/includes/user/ActorStore.php:415
15:10:22 /workspace/src/tests/phpunit/integration/includes/user/ActorStoreTest.php:150
15:10:22 phpvfscomposer:///workspace/src/vendor/phpunit/phpunit/phpunit:106
Logs generated by test
Show Details
15:10:22
15:10:22 87) MediaWiki\Tests\User\ActorStoreTest::testAcquireActorId with data set "anon" (Closure Object (...))
15:10:22 CannotCreateActorException: Cannot create an actor for an IP user when temporary accounts are enabled
15:10:22
15:10:22 /workspace/src/includes/user/ActorStore.php:638
15:10:22 /workspace/src/includes/user/ActorStore.php:415
15:10:22 /workspace/src/tests/phpunit/integration/includes/user/ActorStoreTest.php:506
15:10:22 phpvfscomposer:///workspace/src/vendor/phpunit/phpunit/phpunit:106
Logs generated by test
Show Details
15:10:22
15:10:22 88) MediaWiki\Tests\User\ActorStoreTest::testAcquireActorId with data set "User object" (Closure Object (...))
15:10:22 CannotCreateActorException: Cannot create an actor for an IP user when temporary accounts are enabled
15:10:22
15:10:22 /workspace/src/includes/user/ActorStore.php:638
15:10:22 /workspace/src/includes/user/ActorStore.php:415
15:10:22 /workspace/src/tests/phpunit/integration/includes/user/ActorStoreTest.php:506
15:10:22 phpvfscomposer:///workspace/src/vendor/phpunit/phpunit/phpunit:106
Logs generated by test
Show Details
15:10:22
15:10:22 89) MediaWiki\Tests\User\ActorStoreTest::testAcquireActorId_foreign with data set "anon" (Closure Object (...), 'acquireActorId')
15:10:22 CannotCreateActorException: Cannot create an actor for an IP user when temporary accounts are enabled
15:10:22
15:10:22 /workspace/src/includes/user/ActorStore.php:638
15:10:22 /workspace/src/includes/user/ActorStore.php:415
15:10:22 /workspace/src/tests/phpunit/integration/includes/user/ActorStoreTest.php:549
15:10:22 /workspace/src/tests/phpunit/integration/includes/user/ActorStoreTestBase.php:83
15:10:22 /workspace/src/tests/phpunit/integration/includes/user/ActorStoreTest.php:554
15:10:22 phpvfscomposer:///workspace/src/vendor/phpunit/phpunit/phpunit:106
Logs generated by test
Show Details
15:10:22
15:10:22 90) MediaWiki\Tests\User\ActorStoreTest::testAcquireActorId_foreign with data set "anon, new" (Closure Object (...), 'createNewActor')
15:10:22 CannotCreateActorException: Cannot create an actor for an IP user when temporary accounts are enabled
15:10:22
15:10:22 /workspace/src/includes/user/ActorStore.php:638
15:10:22 /workspace/src/includes/user/ActorStore.php:467
15:10:22 /workspace/src/tests/phpunit/integration/includes/user/ActorStoreTest.php:549
15:10:22 /workspace/src/tests/phpunit/integration/includes/user/ActorStoreTestBase.php:83
15:10:22 /workspace/src/tests/phpunit/integration/includes/user/ActorStoreTest.php:554
15:10:22 phpvfscomposer:///workspace/src/vendor/phpunit/phpunit/phpunit:106
Logs generated by test
Show Details
15:10:22
15:10:22 91) MediaWiki\Tests\User\ActorStoreTest::testAcquireActorId_foreign_withDBConnection with data set "anon" (Closure Object (...), 'acquireActorId')
15:10:22 CannotCreateActorException: Cannot create an actor for an IP user when temporary accounts are enabled
15:10:22
15:10:22 /workspace/src/includes/user/ActorStore.php:638
15:10:22 /workspace/src/includes/user/ActorStore.php:415
15:10:22 /workspace/src/tests/phpunit/integration/includes/user/ActorStoreTest.php:566
15:10:22 /workspace/src/tests/phpunit/integration/includes/user/ActorStoreTestBase.php:83
15:10:22 /workspace/src/tests/phpunit/integration/includes/user/ActorStoreTest.php:571
15:10:22 phpvfscomposer:///workspace/src/vendor/phpunit/phpunit/phpunit:106
Logs generated by test
Show Details
15:10:22
15:10:22 92) MediaWiki\Tests\User\ActorStoreTest::testAcquireActorId_foreign_withDBConnection with data set "anon, new" (Closure Object (...), 'createNewActor')
15:10:22 CannotCreateActorException: Cannot create an actor for an IP user when temporary accounts are enabled
15:10:22
15:10:22 /workspace/src/includes/user/ActorStore.php:638
15:10:22 /workspace/src/includes/user/ActorStore.php:467
15:10:22 /workspace/src/tests/phpunit/integration/includes/user/ActorStoreTest.php:566
15:10:22 /workspace/src/tests/phpunit/integration/includes/user/ActorStoreTestBase.php:83
15:10:22 /workspace/src/tests/phpunit/integration/includes/user/ActorStoreTest.php:571
15:10:22 phpvfscomposer:///workspace/src/vendor/phpunit/phpunit/phpunit:106
Logs generated by test
Show Details
15:10:22
15:10:22 93) MediaWiki\Tests\User\ActorStoreTest::testAcquireActorId_existing with data set "anon" (MediaWiki\User\UserIdentityValue Object (...), 43)
15:10:22 CannotCreateActorException: Cannot create an actor for an IP user when temporary accounts are enabled
15:10:22
15:10:22 /workspace/src/includes/user/ActorStore.php:638
15:10:22 /workspace/src/includes/user/ActorStore.php:415
15:10:22 /workspace/src/tests/phpunit/integration/includes/user/ActorStoreTest.php:654
15:10:22 phpvfscomposer:///workspace/src/vendor/phpunit/phpunit/phpunit:106
Logs generated by test
Show Details
15:10:22
15:10:22 94) MediaWiki\Tests\User\ActorStoreTest::testAcquireActorId_clearCacheOnRollback
15:10:22 CannotCreateActorException: Cannot create an actor for an IP user when temporary accounts are enabled
15:10:22
15:10:22 /workspace/src/includes/user/ActorStore.php:638
15:10:22 /workspace/src/includes/user/ActorStore.php:415
15:10:22 /workspace/src/tests/phpunit/integration/includes/user/ActorStoreTest.php:694
15:10:22 phpvfscomposer:///workspace/src/vendor/phpunit/phpunit/phpunit:106
Logs generated by test
Show Details
15:10:22
15:10:22 95) MediaWiki\Tests\User\ActorStoreTest::testAcquireSystemActorId
15:10:22 CannotCreateActorException: Cannot create an actor for an IP user when temporary accounts are enabled
15:10:22
15:10:22 /workspace/src/includes/user/ActorStore.php:638
15:10:22 /workspace/src/includes/user/ActorStore.php:467
15:10:22 /workspace/src/tests/phpunit/integration/includes/user/ActorStoreTest.php:738
15:10:22 phpvfscomposer:///workspace/src/vendor/phpunit/phpunit/phpunit:106
Logs generated by test
Show Details
15:10:22
15:10:22 96) MediaWiki\Tests\User\ActorStoreTest::testAcquireSystemActorId_assignsNew
15:10:22 CannotCreateActorException: Cannot create an actor for an IP user when temporary accounts are enabled
15:10:22
15:10:22 /workspace/src/includes/user/ActorStore.php:638
15:10:22 /workspace/src/includes/user/ActorStore.php:507
15:10:22 /workspace/src/tests/phpunit/integration/includes/user/ActorStoreTest.php:769
15:10:22 phpvfscomposer:///workspace/src/vendor/phpunit/phpunit/phpunit:106
Logs generated by test
Show Details
15:10:22
15:10:22 --
15:10:22
15:10:22 There were 50 failures:
15:10:22
15:10:22 1) MediaWiki\Tests\Api\ApiEditPageTest::testCreateImageRedirectAnon
15:10:22 Failed asserting that 'noimageredirect' is equal to expected API error code 'noimageredirect-anon'.
15:10:22
15:10:22 /workspace/src/tests/phpunit/includes/api/ApiTestCase.php:326
15:10:22 /workspace/src/tests/phpunit/includes/api/ApiTestCase.php:343
15:10:22 phpvfscomposer:///workspace/src/vendor/phpunit/phpunit/phpunit:106
Logs generated by test
Show Details
15:10:22
15:10:22 2) AuthenticatedFileEntryPointTest::testStreamFile with data set "public wiki" ('')
15:10:22 <!DOCTYPE html>
15:10:22 <html>
15:10:22 <head>
15:10:22 <meta charset="UTF-8" />
15:10:22 <meta name="color-scheme" content="light dark" />
15:10:22 <title>Access denied</title>
15:10:22 </head>
15:10:22 <body>
15:10:22 <h1>Access denied</h1>
15:10:22 <p>File &quot;mwstore://test/test-public/d/d9/Test.png&quot; does not exist.</p>
15:10:22 </body>
15:10:22 </html>
15:10:22
15:10:22 Failed asserting that 403 is identical to 200.
15:10:22
15:10:22 /workspace/src/tests/phpunit/mocks/MockEnvironment.php:140
15:10:22 /workspace/src/tests/phpunit/includes/filerepo/AuthenticatedFileEntryPointTest.php:281
15:10:22 phpvfscomposer:///workspace/src/vendor/phpunit/phpunit/phpunit:106
Logs generated by test
Show Details
15:10:22
15:10:22 3) AuthenticatedFileEntryPointTest::testStreamFile with data set "private wiki" ('', array(array(), array(true)), array(), array(), array('private', 'Cookie'))
15:10:22 <!DOCTYPE html>
15:10:22 <html>
15:10:22 <head>
15:10:22 <meta charset="UTF-8" />
15:10:22 <meta name="color-scheme" content="light dark" />
15:10:22 <title>Access denied</title>
15:10:22 </head>
15:10:22 <body>
15:10:22 <h1>Access denied</h1>
15:10:22 <p>File &quot;mwstore://test/test-public/d/d9/Test.png&quot; does not exist.</p>
15:10:22 </body>
15:10:22 </html>
15:10:22
15:10:22 Failed asserting that 403 is identical to 200.
15:10:22
15:10:22 /workspace/src/tests/phpunit/mocks/MockEnvironment.php:140
15:10:22 /workspace/src/tests/phpunit/includes/filerepo/AuthenticatedFileEntryPointTest.php:281
15:10:22 phpvfscomposer:///workspace/src/vendor/phpunit/phpunit/phpunit:106
Logs generated by test
Show Details
15:10:22
15:10:22 4) AuthenticatedFileEntryPointTest::testStreamFile with data set "range" ('', array(), array(), array('bytes=0-99'), array('bytes 0-99/365', '100'), 206)
15:10:22 <!DOCTYPE html>
15:10:22 <html>
15:10:22 <head>
15:10:22 <meta charset="UTF-8" />
15:10:22 <meta name="color-scheme" content="light dark" />
15:10:22 <title>Access denied</title>
15:10:22 </head>
15:10:22 <body>
15:10:22 <h1>Access denied</h1>
15:10:22 <p>File &quot;mwstore://test/test-public/d/d9/Test.png&quot; does not exist.</p>
15:10:22 </body>
15:10:22 </html>
15:10:22
15:10:22 Failed asserting that 403 is identical to 206.
15:10:22
15:10:22 /workspace/src/tests/phpunit/mocks/MockEnvironment.php:140
15:10:22 /workspace/src/tests/phpunit/includes/filerepo/AuthenticatedFileEntryPointTest.php:281
15:10:22 phpvfscomposer:///workspace/src/vendor/phpunit/phpunit/phpunit:106
Logs generated by test
Show Details
15:10:22
15:10:22 5) AuthenticatedFileEntryPointTest::testStreamFile with data set "download" ('', array(), array(1), array(), array('attachment'))
15:10:22 <!DOCTYPE html>
15:10:22 <html>
15:10:22 <head>
15:10:22 <meta charset="UTF-8" />
15:10:22 <meta name="color-scheme" content="light dark" />
15:10:22 <title>Access denied</title>
15:10:22 </head>
15:10:22 <body>
15:10:22 <h1>Access denied</h1>
15:10:22 <p>File &quot;mwstore://test/test-public/d/d9/Test.png&quot; does not exist.</p>
15:10:22 </body>
15:10:22 </html>
15:10:22
15:10:22 Failed asserting that 403 is identical to 200.
15:10:22
15:10:22 /workspace/src/tests/phpunit/mocks/MockEnvironment.php:140
15:10:22 /workspace/src/tests/phpunit/includes/filerepo/AuthenticatedFileEntryPointTest.php:281
15:10:22 phpvfscomposer:///workspace/src/vendor/phpunit/phpunit/phpunit:106
Logs generated by test
Show Details
15:10:22
15:10:22 6) AuthenticatedFileEntryPointTest::testStreamFile with data set "thumb zone" ('thumb')
15:10:22 <!DOCTYPE html>
15:10:22 <html>
15:10:22 <head>
15:10:22 <meta charset="UTF-8" />
15:10:22 <meta name="color-scheme" content="light dark" />
15:10:22 <title>Access denied</title>
15:10:22 </head>
15:10:22 <body>
15:10:22 <h1>Access denied</h1>
15:10:22 <p>File &quot;mwstore://test/test-thumb/d/d9/Test.png&quot; does not exist.</p>
15:10:22 </body>
15:10:22 </html>
15:10:22
15:10:22 Failed asserting that 403 is identical to 200.
15:10:22
15:10:22 /workspace/src/tests/phpunit/mocks/MockEnvironment.php:140
15:10:22 /workspace/src/tests/phpunit/includes/filerepo/AuthenticatedFileEntryPointTest.php:281
15:10:22 phpvfscomposer:///workspace/src/vendor/phpunit/phpunit/phpunit:106
Logs generated by test
Show Details
15:10:22
15:10:22 7) AuthenticatedFileEntryPointTest::testStreamFile with data set "mapped prefix" ('testing')
15:10:22 <!DOCTYPE html>
15:10:22 <html>
15:10:22 <head>
15:10:22 <meta charset="UTF-8" />
15:10:22 <meta name="color-scheme" content="light dark" />
15:10:22 <title>Access denied</title>
15:10:22 </head>
15:10:22 <body>
15:10:22 <h1>Access denied</h1>
15:10:22 <p>File &quot;/testing/d/d9/Test.png&quot; does not exist.</p>
15:10:22 </body>
15:10:22 </html>
15:10:22
15:10:22 Failed asserting that 403 is identical to 200.
15:10:22
15:10:22 /workspace/src/tests/phpunit/mocks/MockEnvironment.php:140
15:10:22 /workspace/src/tests/phpunit/includes/filerepo/AuthenticatedFileEntryPointTest.php:281
15:10:22 phpvfscomposer:///workspace/src/vendor/phpunit/phpunit/phpunit:106
Logs generated by test
Show Details
15:10:22
15:10:22 8) AuthenticatedFileEntryPointTest::testStreamFile with data set "use ImgAuthPath" ('/img_auth/')
15:10:22 <!DOCTYPE html>
15:10:22 <html>
15:10:22 <head>
15:10:22 <meta charset="UTF-8" />
15:10:22 <meta name="color-scheme" content="light dark" />
15:10:22 <title>Access denied</title>
15:10:22 </head>
15:10:22 <body>
15:10:22 <h1>Access denied</h1>
15:10:22 <p>File &quot;mwstore://test/test-public/d/d9/Test.png&quot; does not exist.</p>
15:10:22 </body>
15:10:22 </html>
15:10:22
15:10:22 Failed asserting that 403 is identical to 200.
15:10:22
15:10:22 /workspace/src/tests/phpunit/mocks/MockEnvironment.php:140
15:10:22 /workspace/src/tests/phpunit/includes/filerepo/AuthenticatedFileEntryPointTest.php:281
15:10:22 phpvfscomposer:///workspace/src/vendor/phpunit/phpunit/phpunit:106
Logs generated by test
Show Details
15:10:22
15:10:22 9) AuthenticatedFileEntryPointTest::testNotModified
15:10:22 HTTP status
15:10:22 Failed asserting that 403 is identical to 304.
15:10:22
15:10:22 /workspace/src/tests/phpunit/mocks/MockEnvironment.php:140
15:10:22 /workspace/src/tests/phpunit/includes/filerepo/AuthenticatedFileEntryPointTest.php:329
15:10:22 phpvfscomposer:///workspace/src/vendor/phpunit/phpunit/phpunit:106
Logs generated by test
Show Details
15:10:22
15:10:22 10) AuthenticatedFileEntryPointTest::testAccessDenied with data set "no prefix" ('')
15:10:22 Failed asserting that '<!DOCTYPE html>\n
15:10:22 <html>\n
15:10:22 <head>\n
15:10:22 <meta charset="UTF-8" />\n
15:10:22 <meta name="color-scheme" content="light dark" />\n
15:10:22 <title>Access denied</title>\n
15:10:22 </head>\n
15:10:22 <body>\n
15:10:22 <h1>Access denied</h1>\n
15:10:22 <p>File &quot;mwstore://test/test-public/d/d9/Test.png&quot; does not exist.</p>\n
15:10:22 </body>\n
15:10:22 </html>\n
15:10:22 ' contains "User does not have access to read".
15:10:22
15:10:22 /workspace/src/tests/phpunit/includes/filerepo/AuthenticatedFileEntryPointTest.php:381
15:10:22 phpvfscomposer:///workspace/src/vendor/phpunit/phpunit/phpunit:106
Logs generated by test
Show Details
15:10:22
15:10:22 11) AuthenticatedFileEntryPointTest::testAccessDenied with data set "thumb zone" ('thumb')
15:10:22 Failed asserting that '<!DOCTYPE html>\n
15:10:22 <html>\n
15:10:22 <head>\n
15:10:22 <meta charset="UTF-8" />\n
15:10:22 <meta name="color-scheme" content="light dark" />\n
15:10:22 <title>Access denied</title>\n
15:10:22 </head>\n
15:10:22 <body>\n
15:10:22 <h1>Access denied</h1>\n
15:10:22 <p>File &quot;mwstore://test/test-thumb/d/d9/Test.png&quot; does not exist.</p>\n
15:10:22 </body>\n
15:10:22 </html>\n
15:10:22 ' contains "User does not have access to read".
15:10:22
15:10:22 /workspace/src/tests/phpunit/includes/filerepo/AuthenticatedFileEntryPointTest.php:381
15:10:22 phpvfscomposer:///workspace/src/vendor/phpunit/phpunit/phpunit:106
Logs generated by test
Show Details
15:10:22
15:10:22 12) AuthenticatedFileEntryPointTest::testAccessDenied_hook
15:10:22 Failed asserting that '<!DOCTYPE html>\n
15:10:22 <html>\n
15:10:22 <head>\n
15:10:22 <meta charset="UTF-8" />\n
15:10:22 <meta name="color-scheme" content="light dark" />\n
15:10:22 <title>Access denied</title>\n
15:10:22 </head>\n
15:10:22 <body>\n
15:10:22 <h1>Access denied</h1>\n
15:10:22 <p>File &quot;mwstore://test/test-public/d/d9/Test.png&quot; does not exist.</p>\n
15:10:22 </body>\n
15:10:22 </html>\n
15:10:22 ' contains "<h1>⧼test-title⧽</h1>".
15:10:22
15:10:22 /workspace/src/tests/phpunit/includes/filerepo/AuthenticatedFileEntryPointTest.php:408
15:10:22 phpvfscomposer:///workspace/src/vendor/phpunit/phpunit/phpunit:106
Logs generated by test
Show Details
15:10:22
15:10:22 13) Thumbnail404EntryPointTest::testStreamFile
15:10:22 HTTP status
15:10:22 Failed asserting that 404 is identical to 200.
15:10:22
15:10:22 /workspace/src/tests/phpunit/mocks/MockEnvironment.php:140
15:10:22 /workspace/src/tests/phpunit/includes/filerepo/Thumbnail404EntryPointTest.php:155
15:10:22 phpvfscomposer:///workspace/src/vendor/phpunit/phpunit/phpunit:106
Logs generated by test
Show Details
15:10:22
15:10:22 14) Thumbnail404EntryPointTest::testStreamFileWithThumbPath
15:10:22 HTTP status
15:10:22 Failed asserting that 404 is identical to 200.
15:10:22
15:10:22 /workspace/src/tests/phpunit/mocks/MockEnvironment.php:140
15:10:22 /workspace/src/tests/phpunit/includes/filerepo/Thumbnail404EntryPointTest.php:177
15:10:22 phpvfscomposer:///workspace/src/vendor/phpunit/phpunit/phpunit:106
Logs generated by test
Show Details
15:10:22
15:10:22 15) Thumbnail404EntryPointTest::testStreamFileWithLongName
15:10:22 <!DOCTYPE html>
15:10:22 <html><head>
15:10:22 <meta charset="UTF-8" />
15:10:22 <meta name="color-scheme" content="light dark" />
15:10:22 <title>Error generating thumbnail</title>
15:10:22 </head>
15:10:22 <body>
15:10:22 <h1>Error generating thumbnail</h1>
15:10:22 <p>
15:10:22 The source file 'Animated_PNG_example_bouncing_beach_ball.png' does not exist.
15:10:22 </p>
15:10:22 <!-- /w/images/thumb/1/14/Animated_PNG_example_bouncing_beach_ball.png/13px-thumbnail.png -->
15:10:22 <!-- a5c8442aac83 -->
15:10:22
15:10:22 </body>
15:10:22 </html>
15:10:22
15:10:22 Failed asserting that 404 is identical to 200.
15:10:22
15:10:22 /workspace/src/tests/phpunit/mocks/MockEnvironment.php:140
15:10:22 /workspace/src/tests/phpunit/includes/filerepo/Thumbnail404EntryPointTest.php:200
15:10:22 phpvfscomposer:///workspace/src/vendor/phpunit/phpunit/phpunit:106
Logs generated by test
Show Details
15:10:22
15:10:22 16) ThumbnailEntryPointTest::testGenerateAndStreamThumbnail
15:10:22 Failed asserting that two strings are identical.
15:10:22 --- Expected
15:10:22 +++ Actual
15:10:22 @@ @@
15:10:22 -'image/png'
15:10:22 +'text/html; charset=utf-8'
15:10:22
15:10:22 /workspace/src/tests/phpunit/includes/filerepo/ThumbnailEntryPointTest.php:174
15:10:22 phpvfscomposer:///workspace/src/vendor/phpunit/phpunit/phpunit:106
Logs generated by test
Show Details
15:10:22
15:10:22 17) ThumbnailEntryPointTest::testNoThumbName
15:10:22 <!DOCTYPE html>
15:10:22 <html><head>
15:10:22 <meta charset="UTF-8" />
15:10:22 <meta name="color-scheme" content="light dark" />
15:10:22 <title>Error generating thumbnail</title>
15:10:22 </head>
15:10:22 <body>
15:10:22 <h1>Error generating thumbnail</h1>
15:10:22 <p>
15:10:22 The source file 'Test.png' does not exist.
15:10:22 </p>
15:10:22 <!-- /w/img.php -->
15:10:22 <!-- a5c8442aac83 -->
15:10:22
15:10:22 </body>
15:10:22 </html>
15:10:22
15:10:22 Failed asserting that 404 is identical to 400.
15:10:22
15:10:22 /workspace/src/tests/phpunit/mocks/MockEnvironment.php:140
15:10:22 /workspace/src/tests/phpunit/includes/filerepo/ThumbnailEntryPointTest.php:239
15:10:22 phpvfscomposer:///workspace/src/vendor/phpunit/phpunit/phpunit:106
Logs generated by test
Show Details
15:10:22
15:10:22 18) ThumbnailEntryPointTest::testTransformError with data set "MediaTransformError" (MediaTransformError Object (...), 500)
15:10:22
15:10:22
15:10:22 You should really speed up these slow tests (>100ms)...
15:10:22 1. 2839ms to run ResourcesTest::testResourceFiles
15:10:22 2. 1615ms to run DatabaseSqliteUpgradeTest::testUpgradeFromVersion with data set #4
15:10:22 3. 1305ms to run DatabaseSqliteUpgradeTest::testUpgradeFromVersion with data set #3
15:10:22 4. 1282ms to run DatabaseSqliteUpgradeTest::testUpgradeFromVersion with data set #2
15:10:22 5. 1274ms to run DatabaseSqliteUpgradeTest::testUpgradeFromVersion with data set #0
15:10:22 6. 1274ms to run DatabaseSqliteUpgradeTest::testUpgradeFromVersion with data set #1
15:10:22 7. 1271ms to run DatabaseSqliteUpgradeTest::testUpgradeFromVersion with data set #5
15:10:22 8. 1235ms to run DatabaseSqliteUpgradeTest::testUpgradeFromVersion with data set #6
15:10:22 9. 1158ms to run MediaWiki\\Tests\\Api\\Query\\ApiQueryUserContribsTest::testSorting with data set "Named users, "
15:10:22 10. 946ms to run MediaWiki\\Skins\\Vector\\Tests\\Structure\\PerformanceBudgetTest::testTotalModulesSize with data set "vector-2022"
15:10:22 ...and there are 864 more above your threshold hidden from view
15:10:22 <!DOCTYPE html>
15:10:22 <html><head>
15:10:22 <meta charset="UTF-8" />
15:10:22 <meta name="color-scheme" content="light dark" />
15:10:22 <title>Error generating thumbnail</title>
15:10:22 </head>
15:10:22 <body>
15:10:22 <h1>Error generating thumbnail</h1>
15:10:22 <p>
15:10:22 The source file 'Test.png' does not exist.
15:10:22 </p>
15:10:22 <!-- /w/img.php -->
15:10:22 <!-- a5c8442aac83 -->
15:10:22
15:10:22 </body>
15:10:22 </html>
15:10:22
15:10:22 Failed asserting that 404 is identical to 500.
15:10:22
15:10:22 /workspace/src/tests/phpunit/mocks/MockEnvironment.php:140
15:10:22 /workspace/src/tests/phpunit/includes/filerepo/ThumbnailEntryPointTest.php:295
15:10:22 phpvfscomposer:///workspace/src/vendor/phpunit/phpunit/phpunit:106
Logs generated by test
Show Details
15:10:22
15:10:22 19) ThumbnailEntryPointTest::testTransformError with data set "thumbnail_image-failure-limit" (MediaTransformError Object (...), 429)
15:10:22 <!DOCTYPE html>
15:10:22 <html><head>
15:10:22 <meta charset="UTF-8" />
15:10:22 <meta name="color-scheme" content="light dark" />
15:10:22 <title>Error generating thumbnail</title>
15:10:22 </head>
15:10:22 <body>
15:10:22 <h1>Error generating thumbnail</h1>
15:10:22 <p>
15:10:22 The source file 'Test.png' does not exist.
15:10:22 </p>
15:10:22 <!-- /w/img.php -->
15:10:22 <!-- a5c8442aac83 -->
15:10:22
15:10:22 </body>
15:10:22 </html>
15:10:22
15:10:22 Failed asserting that 404 is identical to 429.
15:10:22
15:10:22 /workspace/src/tests/phpunit/mocks/MockEnvironment.php:140
15:10:22 /workspace/src/tests/phpunit/includes/filerepo/ThumbnailEntryPointTest.php:295
15:10:22 phpvfscomposer:///workspace/src/vendor/phpunit/phpunit/phpunit:106
Logs generated by test
Show Details
15:10:22
15:10:22 20) ThumbnailEntryPointTest::testTransformError with data set "no thumb" (false, 500)
15:10:22 <!DOCTYPE html>
15:10:22 <html><head>
15:10:22 <meta charset="UTF-8" />
15:10:22 <meta name="color-scheme" content="light dark" />
15:10:22 <title>Error generating thumbnail</title>
15:10:22 </head>
15:10:22 <body>
15:10:22 <h1>Error generating thumbnail</h1>
15:10:22 <p>
15:10:22 The source file 'Test.png' does not exist.
15:10:22 </p>
15:10:22 <!-- /w/img.php -->
15:10:22 <!-- a5c8442aac83 -->
15:10:22
15:10:22 </body>
15:10:22 </html>
15:10:22
15:10:22 Failed asserting that 404 is identical to 500.
15:10:22
15:10:22 /workspace/src/tests/phpunit/mocks/MockEnvironment.php:140
15:10:22 /workspace/src/tests/phpunit/includes/filerepo/ThumbnailEntryPointTest.php:295
15:10:22 phpvfscomposer:///workspace/src/vendor/phpunit/phpunit/phpunit:106
Logs generated by test
Show Details
15:10:22
15:10:22 21) ThumbnailEntryPointTest::testTransformError with data set "no file path" (ThumbnailImage Object (...), 500)
15:10:22 <!DOCTYPE html>
15:10:22 <html><head>
15:10:22 <meta charset="UTF-8" />
15:10:22 <meta name="color-scheme" content="light dark" />
15:10:22 <title>Error generating thumbnail</title>
15:10:22 </head>
15:10:22 <body>
15:10:23 <h1>Error generating thumbnail</h1>
15:10:23 <p>
15:10:23 The source file 'Test.png' does not exist.
15:10:23 </p>
15:10:23 <!-- /w/img.php -->
15:10:23 <!-- a5c8442aac83 -->
15:10:23
15:10:23 </body>
15:10:23 </html>
15:10:23
15:10:23 Failed asserting that 404 is identical to 500.
15:10:23
15:10:23 /workspace/src/tests/phpunit/mocks/MockEnvironment.php:140
15:10:23 /workspace/src/tests/phpunit/includes/filerepo/ThumbnailEntryPointTest.php:295
15:10:23 phpvfscomposer:///workspace/src/vendor/phpunit/phpunit/phpunit:106
Logs generated by test
Show Details
15:10:23
15:10:23 22) ThumbnailEntryPointTest::testContentDisposition
15:10:23 HTTP status
15:10:23 Failed asserting that 404 is identical to 200.
15:10:23
15:10:23 /workspace/src/tests/phpunit/mocks/MockEnvironment.php:140
15:10:23 /workspace/src/tests/phpunit/includes/filerepo/ThumbnailEntryPointTest.php:311
15:10:23 phpvfscomposer:///workspace/src/vendor/phpunit/phpunit/phpunit:106
Logs generated by test
Show Details
15:10:23
15:10:23 23) ThumbnailEntryPointTest::testThumbNameParam with data set #0 ('12px-Test.png')
15:10:23 <!DOCTYPE html>
15:10:23 <html><head>
15:10:23 <meta charset="UTF-8" />
15:10:23 <meta name="color-scheme" content="light dark" />
15:10:23 <title>Error generating thumbnail</title>
15:10:23 </head>
15:10:23 <body>
15:10:23 <h1>Error generating thumbnail</h1>
15:10:23 <p>
15:10:23 The source file 'Test.png' does not exist.
15:10:23 </p>
15:10:23 <!-- /w/img.php -->
15:10:23 <!-- a5c8442aac83 -->
15:10:23
15:10:23 </body>
15:10:23 </html>
15:10:23
15:10:23 Failed asserting that 404 is identical to 200.
15:10:23
15:10:23 /workspace/src/tests/phpunit/mocks/MockEnvironment.php:140
15:10:23 /workspace/src/tests/phpunit/includes/filerepo/ThumbnailEntryPointTest.php:343
15:10:23 phpvfscomposer:///workspace/src/vendor/phpunit/phpunit/phpunit:106
Logs generated by test
Show Details
15:10:23
15:10:23 24) ThumbnailEntryPointTest::testThumbNameParam with data set #1 ('page123456-12px-xyz')
15:10:23 <!DOCTYPE html>
15:10:23 <html><head>
15:10:23 <meta charset="UTF-8" />
15:10:23 <meta name="color-scheme" content="light dark" />
15:10:23 <title>Error generating thumbnail</title>
15:10:23 </head>
15:10:23 <body>
15:10:23 <h1>Error generating thumbnail</h1>
15:10:23 <p>
15:10:23 The source file 'Test.png' does not exist.
15:10:23 </p>
15:10:23 <!-- /w/img.php -->
15:10:23 <!-- a5c8442aac83 -->
15:10:23
15:10:23 </body>
15:10:23 </html>
15:10:23
15:10:23 Failed asserting that 404 is identical to 200.
15:10:23
15:10:23 /workspace/src/tests/phpunit/mocks/MockEnvironment.php:140
15:10:23 /workspace/src/tests/phpunit/includes/filerepo/ThumbnailEntryPointTest.php:343
15:10:23 phpvfscomposer:///workspace/src/vendor/phpunit/phpunit/phpunit:106
Logs generated by test
Show Details
15:10:23
15:10:23 25) ThumbnailEntryPointTest::testThumbNameParam with data set #2 ('12px-xyz')
15:10:23 <!DOCTYPE html>
15:10:23 <html><head>
15:10:23 <meta charset="UTF-8" />
15:10:23 <meta name="color-scheme" content="light dark" />
15:10:23 <title>Error generating thumbnail</title>
15:10:23 </head>
15:10:23 <body>
15:10:23 <h1>Error generating thumbnail</h1>
15:10:23 <p>
15:10:23 The source file 'Test.png' does not exist.
15:10:23 </p>
15:10:23 <!-- /w/img.php -->
15:10:23 <!-- a5c8442aac83 -->
15:10:23
15:10:23 </body>
15:10:23 </html>
15:10:23
15:10:23 Failed asserting that 404 is identical to 200.
15:10:23
15:10:23 /workspace/src/tests/phpunit/mocks/MockEnvironment.php:140
15:10:23 /workspace/src/tests/phpunit/includes/filerepo/ThumbnailEntryPointTest.php:343
15:10:23 phpvfscomposer:///workspace/src/vendor/phpunit/phpunit/phpunit:106
Logs generated by test
Show Details
15:10:23
15:10:23 26) ThumbnailEntryPointTest::testAccessOnPrivateWiki
15:10:23 HTTP status
15:10:23 Failed asserting that 404 is identical to 200.
15:10:23
15:10:23 /workspace/src/tests/phpunit/mocks/MockEnvironment.php:140
15:10:23 /workspace/src/tests/phpunit/includes/filerepo/ThumbnailEntryPointTest.php:430
15:10:23 phpvfscomposer:///workspace/src/vendor/phpunit/phpunit/phpunit:106
Logs generated by test
Show Details
15:10:23
15:10:23 27) ThumbnailEntryPointTest::testRateLimited with data set #0 ('16', '24', 'renderfile')
15:10:23 HTTP status
15:10:23 Failed asserting that 404 is identical to 200.
15:10:23
15:10:23 /workspace/src/tests/phpunit/mocks/MockEnvironment.php:140
15:10:23 /workspace/src/tests/phpunit/includes/filerepo/ThumbnailEntryPointTest.php:463
15:10:23 phpvfscomposer:///workspace/src/vendor/phpunit/phpunit/phpunit:106
Logs generated by test
Show Details
15:10:23
15:10:23 28) ThumbnailEntryPointTest::testRateLimited with data set #1 (20, 21, 'renderfile-nonstandard')
15:10:23 HTTP status
15:10:23 Failed asserting that 404 is identical to 200.
15:10:23
15:10:23 /workspace/src/tests/phpunit/mocks/MockEnvironment.php:140
15:10:23 /workspace/src/tests/phpunit/includes/filerepo/ThumbnailEntryPointTest.php:463
15:10:23 phpvfscomposer:///workspace/src/vendor/phpunit/phpunit/phpunit:106
Logs generated by test
Show Details
15:10:23
15:10:23 29) ThumbnailEntryPointTest::testRedirect
15:10:23 Failed asserting that 404 is identical to 302.
15:10:23
15:10:23 /workspace/src/tests/phpunit/includes/filerepo/ThumbnailEntryPointTest.php:614
15:10:23 phpvfscomposer:///workspace/src/vendor/phpunit/phpunit/phpunit:106
Logs generated by test
Show Details
15:10:23
15:10:23 30) ThumbnailEntryPointTest::testTooMuchWidth
15:10:23 HTTP status
15:10:23 Failed asserting that 404 is identical to 400.
15:10:23
15:10:23 /workspace/src/tests/phpunit/mocks/MockEnvironment.php:140
15:10:23 /workspace/src/tests/phpunit/includes/filerepo/ThumbnailEntryPointTest.php:684
15:10:23 phpvfscomposer:///workspace/src/vendor/phpunit/phpunit/phpunit:106
Logs generated by test
Show Details
15:10:23
15:10:23 31) ThumbnailEntryPointTest::testDeletedFile
15:10:23 Failed asserting that false is true.
15:10:23
15:10:23 /workspace/src/tests/phpunit/includes/filerepo/ThumbnailEntryPointTest.php:704
15:10:23 phpvfscomposer:///workspace/src/vendor/phpunit/phpunit/phpunit:106
Logs generated by test
Show Details
15:10:23
15:10:23 32) ThumbnailEntryPointTest::testNotModified
15:10:23 Failed asserting that 404 is identical to 304.
15:10:23
15:10:23 /workspace/src/tests/phpunit/includes/filerepo/ThumbnailEntryPointTest.php:740
15:10:23 phpvfscomposer:///workspace/src/vendor/phpunit/phpunit/phpunit:106
Logs generated by test
Show Details
15:10:23
15:10:23 33) ThumbnailEntryPointTest::testProxy
15:10:23 Failed asserting that two strings are identical.
15:10:23 --- Expected
15:10:23 +++ Actual
15:10:23 @@ @@
15:10:23 -'PROXY RESPONSE'
15:10:23 +'<!DOCTYPE html>
15:10:23 +<html><head>
15:10:23 +<meta charset="UTF-8" />
15:10:23 +<meta name="color-scheme" content="light dark" />
15:10:23 +<title>Error generating thumbnail</title>
15:10:23 +</head>
15:10:23 +<body>
15:10:23 +<h1>Error generating thumbnail</h1>
15:10:23 +<p>
15:10:23 +The source file 'Test.png' does not exist.
15:10:23 +</p>
15:10:23 +<!-- /w/img.php -->
15:10:23 +<!-- a5c8442aac83 -->
15:10:23 +
15:10:23 +</body>
15:10:23 +</html>
15:10:23 +'
15:10:23
15:10:23 /workspace/src/tests/phpunit/includes/filerepo/ThumbnailEntryPointTest.php:759
15:10:23 phpvfscomposer:///workspace/src/vendor/phpunit/phpunit/phpunit:106
Logs generated by test
Show Details
15:10:23
15:10:23 34) SpecialMyLanguageTest::testFindTitle with data set #3 ('Page/Another/ru', 'Page/Another', 'en', 'ru')
15:10:23 Failed asserting that false is true.
15:10:23
15:10:23 /workspace/src/tests/phpunit/includes/specials/SpecialMyLanguageTest.php:83
15:10:23 /workspace/src/tests/phpunit/includes/specials/SpecialMyLanguageTest.php:69
15:10:23 phpvfscomposer:///workspace/src/vendor/phpunit/phpunit/phpunit:106
Logs generated by test
Show Details
15:10:23
15:10:23 35) SpecialMyLanguageTest::testFindTitle with data set #5 ('Page/Another/zh', 'Page/Another', 'en', 'zh')
15:10:23 Failed asserting that false is true.
15:10:23
15:10:23 /workspace/src/tests/phpunit/includes/specials/SpecialMyLanguageTest.php:83
15:10:23 /workspace/src/tests/phpunit/includes/specials/SpecialMyLanguageTest.php:69
15:10:23 phpvfscomposer:///workspace/src/vendor/phpunit/phpunit/phpunit:106
Logs generated by test
Show Details
15:10:23
15:10:23 36) SpecialMyLanguageTest::testFindTitle with data set #6 ('Page/Another/zh', 'Page/Another', 'en', 'zh-hans')
15:10:23 Failed asserting that false is true.
15:10:23
15:10:23 /workspace/src/tests/phpunit/includes/specials/SpecialMyLanguageTest.php:83
15:10:23 /workspace/src/tests/phpunit/includes/specials/SpecialMyLanguageTest.php:69
15:10:23 phpvfscomposer:///workspace/src/vendor/phpunit/phpunit/phpunit:106
Logs generated by test
Show Details
15:10:23
15:10:23 37) SpecialMyLanguageTest::testFindTitle with data set #7 ('Page/Another/zh', 'Page/Another', 'en', 'zh-mo')
15:10:23 Failed asserting that false is true.
15:10:23
15:10:23 /workspace/src/tests/phpunit/includes/specials/SpecialMyLanguageTest.php:83
15:10:23 /workspace/src/tests/phpunit/includes/specials/SpecialMyLanguageTest.php:69
15:10:23 phpvfscomposer:///workspace/src/vendor/phpunit/phpunit/phpunit:106
Logs generated by test
Show Details
15:10:23
15:10:23 38) SpecialMyLanguageTest::testFindTitle with data set #8 ('Page/Another/zh', 'Page/Another', 'en', 'gan')
15:10:23 Failed asserting that false is true.
15:10:23
15:10:23 /workspace/src/tests/phpunit/includes/specials/SpecialMyLanguageTest.php:83
15:10:23 /workspace/src/tests/phpunit/includes/specials/SpecialMyLanguageTest.php:69
15:10:23 phpvfscomposer:///workspace/src/vendor/phpunit/phpunit/phpunit:106
Logs generated by test
Show Details
15:10:23
15:10:23 39) SpecialMyLanguageTest::testFindTitle with data set #9 ('Page/Another/zh', 'Page/Another', 'en', 'gan-hant')
15:10:23 Failed asserting that false is true.
15:10:23
15:10:23 /workspace/src/tests/phpunit/includes/specials/SpecialMyLanguageTest.php:83
15:10:23 /workspace/src/tests/phpunit/includes/specials/SpecialMyLanguageTest.php:69
15:10:23 phpvfscomposer:///workspace/src/vendor/phpunit/phpunit/phpunit:106
Logs generated by test
Show Details
15:10:23
15:10:23 40) SpecialMyLanguageTest::testFindTitle with data set #10 ('Page/Another/en', 'Page/Another', 'de', 'es')
15:10:23 Failed asserting that false is true.
15:10:23
15:10:23 /workspace/src/tests/phpunit/includes/specials/SpecialMyLanguageTest.php:83
15:10:23 /workspace/src/tests/phpunit/includes/specials/SpecialMyLanguageTest.php:69
15:10:23 phpvfscomposer:///workspace/src/vendor/phpunit/phpunit/phpunit:106
Logs generated by test
Show Details
15:10:23
15:10:23 41) SpecialMyLanguageTest::testFindTitle with data set #11 ('Page/Another/ar', 'Page/Another', 'en', 'ar')
15:10:23 Failed asserting that false is true.
15:10:23
15:10:23 /workspace/src/tests/phpunit/includes/specials/SpecialMyLanguageTest.php:83
15:10:23 /workspace/src/tests/phpunit/includes/specials/SpecialMyLanguageTest.php:69
15:10:23 phpvfscomposer:///workspace/src/vendor/phpunit/phpunit/phpunit:106
Logs generated by test
Show Details
15:10:23
15:10:23 42) SpecialMyLanguageTest::testFindTitle with data set #12 ('Page/Another/ar', 'Page/Another', 'en', 'arz')
15:10:23 Failed asserting that false is true.
15:10:23
15:10:23 /workspace/src/tests/phpunit/includes/specials/SpecialMyLanguageTest.php:83
15:10:23 /workspace/src/tests/phpunit/includes/specials/SpecialMyLanguageTest.php:69
15:10:23 phpvfscomposer:///workspace/src/vendor/phpunit/phpunit/phpunit:106
Logs generated by test
Show Details
15:10:23
15:10:23 43) SpecialMyLanguageTest::testFindTitle with data set #13 ('Page/Another/ar', 'Page/Another/de', 'en', 'arz')
15:10:23 Failed asserting that false is true.
15:10:23
15:10:23 /workspace/src/tests/phpunit/includes/specials/SpecialMyLanguageTest.php:83
15:10:23 /workspace/src/tests/phpunit/includes/specials/SpecialMyLanguageTest.php:69
15:10:23 phpvfscomposer:///workspace/src/vendor/phpunit/phpunit/phpunit:106
Logs generated by test
Show Details
15:10:23
15:10:23 44) SpecialMyLanguageTest::testFindTitle with data set #14 ('Page/Another/ru', 'Page/Another/ru', 'en', 'arz')
15:10:23 Failed asserting that false is true.
15:10:23
15:10:23 /workspace/src/tests/phpunit/includes/specials/SpecialMyLanguageTest.php:83
15:10:23 /workspace/src/tests/phpunit/includes/specials/SpecialMyLanguageTest.php:69
15:10:23 phpvfscomposer:///workspace/src/vendor/phpunit/phpunit/phpunit:106
Logs generated by test
Show Details
15:10:23
15:10:23 45) SpecialMyLanguageTest::testFindTitle with data set #15 ('Page/Another/ar', 'Page/Another/ru', 'en', 'ar')
15:10:23 Failed asserting that false is true.
15:10:23
15:10:23 /workspace/src/tests/phpunit/includes/specials/SpecialMyLanguageTest.php:83
15:10:23 /workspace/src/tests/phpunit/includes/specials/SpecialMyLanguageTest.php:69
15:10:23 phpvfscomposer:///workspace/src/vendor/phpunit/phpunit/phpunit:106
Logs generated by test
Show Details
15:10:23
15:10:23 46) SpecialMyLanguageTest::testFindTitle with data set #18 ('Page/Foreign/en', 'Page/Foreign', 'en', 'en')
15:10:23 Failed asserting that false is true.
15:10:23
15:10:23 /workspace/src/tests/phpunit/includes/specials/SpecialMyLanguageTest.php:83
15:10:23 /workspace/src/tests/phpunit/includes/specials/SpecialMyLanguageTest.php:69
15:10:23 phpvfscomposer:///workspace/src/vendor/phpunit/phpunit/phpunit:106
Logs generated by test
Show Details
15:10:23
15:10:23 47) SpecialMyLanguageTest::testFindTitle with data set #20 ('Page/Another/ar#Section', 'Page/Redirect', 'en', 'ar')
15:10:23 Failed asserting that false is true.
15:10:23
15:10:23 /workspace/src/tests/phpunit/includes/specials/SpecialMyLanguageTest.php:83
15:10:23 /workspace/src/tests/phpunit/includes/specials/SpecialMyLanguageTest.php:69
15:10:23 phpvfscomposer:///workspace/src/vendor/phpunit/phpunit/phpunit:106
Logs generated by test
Show Details
15:10:23
15:10:23 48) SpecialMyLanguageTest::testFindTitleForTransclusion with data set #0 ('Page/Another/en', 'Page/Another/en', 'en', 'en')
15:10:23 Failed asserting that false is true.
15:10:23
15:10:23 /workspace/src/tests/phpunit/includes/specials/SpecialMyLanguageTest.php:83
15:10:23 /workspace/src/tests/phpunit/includes/specials/SpecialMyLanguageTest.php:133
15:10:23 phpvfscomposer:///workspace/src/vendor/phpunit/phpunit/phpunit:106
Logs generated by test
Show Details
15:10:23
15:10:23 49) SpecialMyLanguageTest::testFindTitleForTransclusion with data set #1 ('Page/Another/en', 'Page/Another', 'en', 'en')
15:10:23 Failed asserting that false is true.
15:10:23
15:10:23 /workspace/src/tests/phpunit/includes/specials/SpecialMyLanguageTest.php:83
15:10:23 /workspace/src/tests/phpunit/includes/specials/SpecialMyLanguageTest.php:133
15:10:23 phpvfscomposer:///workspace/src/vendor/phpunit/phpunit/phpunit:106
Logs generated by test
Show Details
15:10:23
15:10:23 50) SpecialMyLanguageTest::testFindTitleForTransclusion with data set #2 ('Page/Another/en', 'Page/Another', 'en', 'frc')
15:10:23 Failed asserting that false is true.
15:10:23
15:10:23 /workspace/src/tests/phpunit/includes/specials/SpecialMyLanguageTest.php:83
15:10:23 /workspace/src/tests/phpunit/includes/specials/SpecialMyLanguageTest.php:133
15:10:23 phpvfscomposer:///workspace/src/vendor/phpunit/phpunit/phpunit:106

Event Timeline

kostajh changed the title of this paste from PHPUnit failures with temp accounts - mediawiki-quibble-vendor-mysql-php74 to PHPUnit core test failures with temp accounts - mediawiki-quibble-vendor-mysql-php74.May 23 2024, 7:10 AM
kostajh changed the title of this paste from PHPUnit core test failures with temp accounts - mediawiki-quibble-vendor-mysql-php74 to PHPUnit MediaWiki core test failures with temp accounts - mediawiki-quibble-vendor-mysql-php74.