Page MenuHomePhabricator
Paste P67207

/usr/lib/chromium/chromium - rosetta
ArchivedPublic

Authored by zeljkofilipin on Aug 2 2024, 1:56 PM.
Project Tags
None
Referenced Files
F56922679: /usr/lib/chromium/chromium - rosetta
Aug 2 2024, 1:56 PM
Subscribers
None
nobody@docker-desktop:/core$ npm run selenium-test
> selenium-test
> wdio ./tests/selenium/wdio.conf.js
Execution of 6 workers started at 2024-08-02T13:54:37.501Z
[0-0] RUNNING in chrome - /tests/selenium/docs/Create_a_simple_test/specs/specialpages.js
[0-1] RUNNING in chrome - /tests/selenium/specs/page.js
[0-3] RUNNING in chrome - /tests/selenium/specs/user.js
[0-2] RUNNING in chrome - /tests/selenium/specs/recentchanges.js
[0-1] 2024-08-02T13:54:47.226Z ERROR @wdio/runner: FetchError: Failed to fetch browser webSocket URL from http://localhost:59387/json/version: request to http://localhost:59387/json/version failed, reason: connect ECONNREFUSED 127.0.0.1:59387
[0-1] at ClientRequest.<anonymous> (/core/node_modules/node-fetch/lib/index.js:1491:11)
[0-1] at ClientRequest.emit (node:events:517:28)
[0-1] at ClientRequest.emit (node:domain:489:12)
[0-1] at Socket.socketErrorListener (node:_http_client:501:9)
[0-1] at Socket.emit (node:events:517:28)
[0-1] at Socket.emit (node:domain:489:12)
[0-1] at emitErrorNT (node:internal/streams/destroy:151:8)
[0-1] at emitErrorCloseNT (node:internal/streams/destroy:116:3)
[0-1] at process.processTicksAndRejections (node:internal/process/task_queues:82:21)
[0-3] 2024-08-02T13:54:47.244Z ERROR @wdio/runner: FetchError: Failed to fetch browser webSocket URL from http://localhost:59739/json/version: request to http://localhost:59739/json/version failed, reason: connect ECONNREFUSED 127.0.0.1:59739
[0-3] at ClientRequest.<anonymous> (/core/node_modules/node-fetch/lib/index.js:1491:11)
[0-3] at ClientRequest.emit (node:events:517:28)
[0-3] at ClientRequest.emit (node:domain:489:12)
[0-3] at Socket.socketErrorListener (node:_http_client:501:9)
[0-3] at Socket.emit (node:events:517:28)
[0-3] at Socket.emit (node:domain:489:12)
[0-3] at emitErrorNT (node:internal/streams/destroy:151:8)
[0-3] at emitErrorCloseNT (node:internal/streams/destroy:116:3)
[0-3] at process.processTicksAndRejections (node:internal/process/task_queues:82:21)
[0-2] 2024-08-02T13:54:47.278Z ERROR @wdio/runner: FetchError: Failed to fetch browser webSocket URL from http://localhost:56417/json/version: request to http://localhost:56417/json/version failed, reason: connect ECONNREFUSED 127.0.0.1:56417
[0-2] at ClientRequest.<anonymous> (/core/node_modules/node-fetch/lib/index.js:1491:11)
[0-2] at ClientRequest.emit (node:events:517:28)
[0-2] at ClientRequest.emit (node:domain:489:12)
[0-2] at Socket.socketErrorListener (node:_http_client:501:9)
[0-2] at Socket.emit (node:events:517:28)
[0-2] at Socket.emit (node:domain:489:12)
[0-2] at emitErrorNT (node:internal/streams/destroy:151:8)
[0-2] at emitErrorCloseNT (node:internal/streams/destroy:116:3)
[0-2] at process.processTicksAndRejections (node:internal/process/task_queues:82:21)
[0-1] RETRYING in chrome - /tests/selenium/specs/page.js
[0-3] RETRYING in chrome - /tests/selenium/specs/user.js
[0-2] RETRYING in chrome - /tests/selenium/specs/recentchanges.js
[0-1] RUNNING in chrome - /tests/selenium/specs/page.js
[0-2] RUNNING in chrome - /tests/selenium/specs/recentchanges.js
[0-3] RUNNING in chrome - /tests/selenium/specs/user.js
[0-1] 2024-08-02T13:54:56.975Z ERROR @wdio/runner: FetchError: Failed to fetch browser webSocket URL from http://localhost:56153/json/version: request to http://localhost:56153/json/version failed, reason: connect ECONNREFUSED 127.0.0.1:56153
[0-1] at ClientRequest.<anonymous> (/core/node_modules/node-fetch/lib/index.js:1491:11)
[0-1] at ClientRequest.emit (node:events:517:28)
[0-1] at ClientRequest.emit (node:domain:489:12)
[0-1] at Socket.socketErrorListener (node:_http_client:501:9)
[0-1] at Socket.emit (node:events:517:28)
[0-1] at Socket.emit (node:domain:489:12)
[0-1] at emitErrorNT (node:internal/streams/destroy:151:8)
[0-1] at emitErrorCloseNT (node:internal/streams/destroy:116:3)
[0-1] at process.processTicksAndRejections (node:internal/process/task_queues:82:21)
[0-2] 2024-08-02T13:54:57.089Z ERROR @wdio/runner: FetchError: Failed to fetch browser webSocket URL from http://localhost:59217/json/version: request to http://localhost:59217/json/version failed, reason: connect ECONNREFUSED 127.0.0.1:59217
[0-2] at ClientRequest.<anonymous> (/core/node_modules/node-fetch/lib/index.js:1491:11)
[0-2] at ClientRequest.emit (node:events:517:28)
[0-2] at ClientRequest.emit (node:domain:489:12)
[0-2] at Socket.socketErrorListener (node:_http_client:501:9)
[0-2] at Socket.emit (node:events:517:28)
[0-2] at Socket.emit (node:domain:489:12)
[0-2] at emitErrorNT (node:internal/streams/destroy:151:8)
[0-2] at emitErrorCloseNT (node:internal/streams/destroy:116:3)
[0-2] at process.processTicksAndRejections (node:internal/process/task_queues:82:21)
[0-1] FAILED in chrome - /tests/selenium/specs/page.js (1 retries)
[0-3] 2024-08-02T13:54:57.149Z ERROR @wdio/runner: FetchError: Failed to fetch browser webSocket URL from http://localhost:57227/json/version: request to http://localhost:57227/json/version failed, reason: connect ECONNREFUSED 127.0.0.1:57227
[0-3] at ClientRequest.<anonymous> (/core/node_modules/node-fetch/lib/index.js:1491:11)
[0-3] at ClientRequest.emit (node:events:517:28)
[0-3] at ClientRequest.emit (node:domain:489:12)
[0-3] at Socket.socketErrorListener (node:_http_client:501:9)
[0-3] at Socket.emit (node:events:517:28)
[0-3] at Socket.emit (node:domain:489:12)
[0-3] at emitErrorNT (node:internal/streams/destroy:151:8)
[0-3] at emitErrorCloseNT (node:internal/streams/destroy:116:3)
[0-3] at process.processTicksAndRejections (node:internal/process/task_queues:82:21)
[0-2] FAILED in chrome - /tests/selenium/specs/recentchanges.js (1 retries)
[0-3] FAILED in chrome - /tests/selenium/specs/user.js (1 retries)
[0-5] RUNNING in chrome - /tests/selenium/wdio-mediawiki/specs/BlankPage.js
[0-4] RUNNING in chrome - /tests/selenium/specs/watchlist.js
[0-5] 2024-08-02T13:55:04.708Z ERROR @wdio/runner: FetchError: Failed to fetch browser webSocket URL from http://localhost:58737/json/version: request to http://localhost:58737/json/version failed, reason: connect ECONNREFUSED 127.0.0.1:58737
[0-5] at ClientRequest.<anonymous> (/core/node_modules/node-fetch/lib/index.js:1491:11)
[0-5] at ClientRequest.emit (node:events:517:28)
[0-5] at ClientRequest.emit (node:domain:489:12)
[0-5] at Socket.socketErrorListener (node:_http_client:501:9)
[0-5] at Socket.emit (node:events:517:28)
[0-5] at Socket.emit (node:domain:489:12)
[0-5] at emitErrorNT (node:internal/streams/destroy:151:8)
[0-5] at emitErrorCloseNT (node:internal/streams/destroy:116:3)
[0-5] at process.processTicksAndRejections (node:internal/process/task_queues:82:21)
[0-5] RETRYING in chrome - /tests/selenium/wdio-mediawiki/specs/BlankPage.js
[0-4] 2024-08-02T13:55:05.444Z ERROR @wdio/runner: FetchError: Failed to fetch browser webSocket URL from http://localhost:59273/json/version: request to http://localhost:59273/json/version failed, reason: connect ECONNREFUSED 127.0.0.1:59273
[0-4] at ClientRequest.<anonymous> (/core/node_modules/node-fetch/lib/index.js:1491:11)
[0-4] at ClientRequest.emit (node:events:517:28)
[0-4] at ClientRequest.emit (node:domain:489:12)
[0-4] at Socket.socketErrorListener (node:_http_client:501:9)
[0-4] at Socket.emit (node:events:517:28)
[0-4] at Socket.emit (node:domain:489:12)
[0-4] at emitErrorNT (node:internal/streams/destroy:151:8)
[0-4] at emitErrorCloseNT (node:internal/streams/destroy:116:3)
[0-4] at process.processTicksAndRejections (node:internal/process/task_queues:82:21)
[0-4] RETRYING in chrome - /tests/selenium/specs/watchlist.js
[0-0] 2024-08-02T13:55:09.892Z ERROR @wdio/runner: Error: connect ECONNREFUSED 127.0.0.1:55753
[0-0] at TCPConnectWrap.afterConnect [as oncomplete] (node:net:1555:16)
[0-0] RETRYING in chrome - /tests/selenium/docs/Create_a_simple_test/specs/specialpages.js
[0-5] RUNNING in chrome - /tests/selenium/wdio-mediawiki/specs/BlankPage.js
[0-5] 2024-08-02T13:55:12.170Z ERROR @wdio/runner: FetchError: Failed to fetch browser webSocket URL from http://localhost:55615/json/version: request to http://localhost:55615/json/version failed, reason: connect ECONNREFUSED 127.0.0.1:55615
[0-5] at ClientRequest.<anonymous> (/core/node_modules/node-fetch/lib/index.js:1491:11)
[0-5] at ClientRequest.emit (node:events:517:28)
[0-5] at ClientRequest.emit (node:domain:489:12)
[0-5] at Socket.socketErrorListener (node:_http_client:501:9)
[0-5] at Socket.emit (node:events:517:28)
[0-5] at Socket.emit (node:domain:489:12)
[0-5] at emitErrorNT (node:internal/streams/destroy:151:8)
[0-5] at emitErrorCloseNT (node:internal/streams/destroy:116:3)
[0-5] at process.processTicksAndRejections (node:internal/process/task_queues:82:21)
[0-5] FAILED in chrome - /tests/selenium/wdio-mediawiki/specs/BlankPage.js (1 retries)
[0-4] RUNNING in chrome - /tests/selenium/specs/watchlist.js
[0-4] 2024-08-02T13:55:14.671Z ERROR @wdio/runner: FetchError: Failed to fetch browser webSocket URL from http://localhost:60251/json/version: request to http://localhost:60251/json/version failed, reason: connect ECONNREFUSED 127.0.0.1:60251
[0-4] at ClientRequest.<anonymous> (/core/node_modules/node-fetch/lib/index.js:1491:11)
[0-4] at ClientRequest.emit (node:events:517:28)
[0-4] at ClientRequest.emit (node:domain:489:12)
[0-4] at Socket.socketErrorListener (node:_http_client:501:9)
[0-4] at Socket.emit (node:events:517:28)
[0-4] at Socket.emit (node:domain:489:12)
[0-4] at emitErrorNT (node:internal/streams/destroy:151:8)
[0-4] at emitErrorCloseNT (node:internal/streams/destroy:116:3)
[0-4] at process.processTicksAndRejections (node:internal/process/task_queues:82:21)
[0-4] FAILED in chrome - /tests/selenium/specs/watchlist.js (1 retries)
[0-0] RUNNING in chrome - /tests/selenium/docs/Create_a_simple_test/specs/specialpages.js
[0-0] 2024-08-02T13:55:41.362Z ERROR @wdio/runner: Error: connect ECONNREFUSED 127.0.0.1:55483
[0-0] at TCPConnectWrap.afterConnect [as oncomplete] (node:net:1555:16)
[0-0] FAILED in chrome - /tests/selenium/docs/Create_a_simple_test/specs/specialpages.js (1 retries)
Spec Files: 0 passed, 6 retries, 6 failed, 6 total (100% completed) in 00:01:04