Page MenuHomePhabricator

db1089 - possibly RAID controller broken
Closed, ResolvedPublic

Description

Several alerts coming from db1089

Notification Type: PROBLEM

Service: mysqld processes
Host: db1089
Address: 10.64.32.115
State: CRITICAL

Date/Time: Sat Jun 3 04:57:25 UTC 2017

Additional Info:

CHECK_NRPE: Socket timeout after 10 seconds.

And the host looks bad:

root@db1089:~# w
-bash: /usr/bin/w: Input/output error

oot@db1089:~# dmesg
[31430433.448555] ACPI Exception: AE_AML_BUFFER_LIMIT, Evaluating _PMM (20150930/power_meter-338)
[31430443.550645] ACPI Error: SMBus/IPMI/GenericSerialBus write requires Buffer of length 66, found length 32 (20150930/exfield-418)
[31430443.550657] ACPI Error: Method parse/execution failed [\_SB.PMI0._PMM] (Node ffff883f7f89de28), AE_AML_BUFFER_LIMIT (20150930/psparse-542)
[31430443.550675] ACPI Exception: AE_AML_BUFFER_LIMIT, Evaluating _PMM (20150930/power_meter-338)
[31430493.450059] ACPI Error: SMBus/IPMI/GenericSerialBus write requires Buffer of length 66, found length 32 (20150930/exfield-418)
[31430493.450070] ACPI Error: Method parse/execution failed [\_SB.PMI0._PMM] (Node ffff883f7f89de28), AE_AML_BUFFER_LIMIT (20150930/psparse-542)
[31430493.450084] ACPI Exception: AE_AML_BUFFER_LIMIT, Evaluating _PMM (20150930/power_meter-338)
[31430503.552067] ACPI Error: SMBus/IPMI/GenericSerialBus write requires Buffer of length 66, found length 32 (20150930/exfield-418)
[31430503.552077] ACPI Error: Method parse/execution failed [\_SB.PMI0._PMM] (Node ffff883f7f89de28), AE_AML_BUFFER_LIMIT (20150930/psparse-542)
[31430503.552088] ACPI Exception: AE_AML_BUFFER_LIMIT, Evaluating _PMM (20150930/power_meter-338)
[31430553.450763] ACPI Error: SMBus/IPMI/GenericSerialBus write requires Buffer of length 66, found length 32 (20150930/exfield-418)
[31430553.450777] ACPI Error: Method parse/execution failed [\_SB.PMI0._PMM] (Node ffff883f7f89de28), AE_AML_BUFFER_LIMIT (20150930/psparse-542)
[31430553.450796] ACPI Exception: AE_AML_BUFFER_LIMIT, Evaluating _PMM (20150930/power_meter-338)
[31430563.558206] ACPI Error: SMBus/IPMI/GenericSerialBus write requires Buffer of length 66, found length 32 (20150930/exfield-418)
[31430563.558218] ACPI Error: Method parse/execution failed [\_SB.PMI0._PMM] (Node ffff883f7f89de28), AE_AML_BUFFER_LIMIT (20150930/psparse-542)
[31430563.558236] ACPI Exception: AE_AML_BUFFER_LIMIT, Evaluating _PMM (20150930/power_meter-338)
[31430613.454058] ACPI Error: SMBus/IPMI/GenericSerialBus write requires Buffer of length 66, found length 32 (20150930/exfield-418)
[31430613.454067] ACPI Error: Method parse/execution failed [\_SB.PMI0._PMM] (Node ffff883f7f89de28), AE_AML_BUFFER_LIMIT (20150930/psparse-542)
[31430613.454081] ACPI Exception: AE_AML_BUFFER_LIMIT, Evaluating _PMM (20150930/power_meter-338)
[31430623.559361] ACPI Error: SMBus/IPMI/GenericSerialBus write requires Buffer of length 66, found length 32 (20150930/exfield-418)
[31430623.559373] ACPI Error: Method parse/execution failed [\_SB.PMI0._PMM] (Node ffff883f7f89de28), AE_AML_BUFFER_LIMIT (20150930/psparse-542)
[31430623.559385] ACPI Exception: AE_AML_BUFFER_LIMIT, Evaluating _PMM (20150930/power_meter-338)
[31430673.455092] ACPI Error: SMBus/IPMI/GenericSerialBus write requires Buffer of length 66, found length 32 (20150930/exfield-418)
[31430673.455105] ACPI Error: Method parse/execution failed [\_SB.PMI0._PMM] (Node ffff883f7f89de28), AE_AML_BUFFER_LIMIT (20150930/psparse-542)
[31430673.455122] ACPI Exception: AE_AML_BUFFER_LIMIT, Evaluating _PMM (20150930/power_meter-338)
[31430683.560920] ACPI Error: SMBus/IPMI/GenericSerialBus write requires Buffer of length 66, found length 32 (20150930/exfield-418)
[31430683.560930] ACPI Error: Method parse/execution failed [\_SB.PMI0._PMM] (Node ffff883f7f89de28), AE_AML_BUFFER_LIMIT (20150930/psparse-542)
[31430683.560943] ACPI Exception: AE_AML_BUFFER_LIMIT, Evaluating _PMM (20150930/power_meter-338)
[31430733.460345] ACPI Error: SMBus/IPMI/GenericSerialBus write requires Buffer of length 66, found length 32 (20150930/exfield-418)
[31430733.460355] ACPI Error: Method parse/execution failed [\_SB.PMI0._PMM] (Node ffff883f7f89de28), AE_AML_BUFFER_LIMIT (20150930/psparse-542)
[31430733.460368] ACPI Exception: AE_AML_BUFFER_LIMIT, Evaluating _PMM (20150930/power_meter-338)
[31430743.562702] ACPI Error: SMBus/IPMI/GenericSerialBus write requires Buffer of length 66, found length 32 (20150930/exfield-418)
[31430743.562713] ACPI Error: Method parse/execution failed [\_SB.PMI0._PMM] (Node ffff883f7f89de28), AE_AML_BUFFER_LIMIT (20150930/psparse-542)
[31430743.562727] ACPI Exception: AE_AML_BUFFER_LIMIT, Evaluating _PMM (20150930/power_meter-338)
[31430793.461310] ACPI Error: SMBus/IPMI/GenericSerialBus write requires Buffer of length 66, found length 32 (20150930/exfield-418)
[31430793.461322] ACPI Error: Method parse/execution failed [\_SB.PMI0._PMM] (Node ffff883f7f89de28), AE_AML_BUFFER_LIMIT (20150930/psparse-542)
[31430793.461341] ACPI Exception: AE_AML_BUFFER_LIMIT, Evaluating _PMM (20150930/power_meter-338)
[31430803.565202] ACPI Error: SMBus/IPMI/GenericSerialBus write requires Buffer of length 66, found length 32 (20150930/exfield-418)
[31430803.565212] ACPI Error: Method parse/execution failed [\_SB.PMI0._PMM] (Node ffff883f7f89de28), AE_AML_BUFFER_LIMIT (20150930/psparse-542)
[31430803.565223] ACPI Exception: AE_AML_BUFFER_LIMIT, Evaluating _PMM (20150930/power_meter-338)
[31430853.465325] ACPI Error: SMBus/IPMI/GenericSerialBus write requires Buffer of length 66, found length 32 (20150930/exfield-418)
[31430853.465338] ACPI Error: Method parse/execution failed [\_SB.PMI0._PMM] (Node ffff883f7f89de28), AE_AML_BUFFER_LIMIT (20150930/psparse-542)
[31430853.465357] ACPI Exception: AE_AML_BUFFER_LIMIT, Evaluating _PMM (20150930/power_meter-338)
[31430863.580512] ACPI Error: SMBus/IPMI/GenericSerialBus write requires Buffer of length 66, found length 32 (20150930/exfield-418)
[31430863.580525] ACPI Error: Method parse/execution failed [\_SB.PMI0._PMM] (Node ffff883f7f89de28), AE_AML_BUFFER_LIMIT (20150930/psparse-542)
[31430863.580542] ACPI Exception: AE_AML_BUFFER_LIMIT, Evaluating _PMM (20150930/power_meter-338)
[31430913.466459] ACPI Error: SMBus/IPMI/GenericSerialBus write requires Buffer of length 66, found length 32 (20150930/exfield-418)
[31430913.466474] ACPI Error: Method parse/execution failed [\_SB.PMI0._PMM] (Node ffff883f7f89de28), AE_AML_BUFFER_LIMIT (20150930/psparse-542)
[31430913.466493] ACPI Exception: AE_AML_BUFFER_LIMIT, Evaluating _PMM (20150930/power_meter-338)
[31430923.572568] ACPI Error: SMBus/IPMI/GenericSerialBus write requires Buffer of length 66, found length 32 (20150930/exfield-418)
[31430923.572583] ACPI Error: Method parse/execution failed [\_SB.PMI0._PMM] (Node ffff883f7f89de28), AE_AML_BUFFER_LIMIT (20150930/psparse-542)
[31430923.572602] ACPI Exception: AE_AML_BUFFER_LIMIT, Evaluating _PMM (20150930/power_meter-338)
[31430973.468107] ACPI Error: SMBus/IPMI/GenericSerialBus write requires Buffer of length 66, found length 32 (20150930/exfield-418)
[31430973.468118] ACPI Error: Method parse/execution failed [\_SB.PMI0._PMM] (Node ffff883f7f89de28), AE_AML_BUFFER_LIMIT (20150930/psparse-542)
[31430973.468133] ACPI Exception: AE_AML_BUFFER_LIMIT, Evaluating _PMM (20150930/power_meter-338)
[31430983.572987] ACPI Error: SMBus/IPMI/GenericSerialBus write requires Buffer of length 66, found length 32 (20150930/exfield-418)
[31430983.573000] ACPI Error: Method parse/execution failed [\_SB.PMI0._PMM] (Node ffff883f7f89de28), AE_AML_BUFFER_LIMIT (20150930/psparse-542)
[31430983.573017] ACPI Exception: AE_AML_BUFFER_LIMIT, Evaluating _PMM (20150930/power_meter-338)
[31431033.472270] ACPI Error: SMBus/IPMI/GenericSerialBus write requires Buffer of length 66, found length 32 (20150930/exfield-418)
[31431033.472283] ACPI Error: Method parse/execution failed [\_SB.PMI0._PMM] (Node ffff883f7f89de28), AE_AML_BUFFER_LIMIT (20150930/psparse-542)
[31431033.472301] ACPI Exception: AE_AML_BUFFER_LIMIT, Evaluating _PMM (20150930/power_meter-338)
[31431043.575136] ACPI Error: SMBus/IPMI/GenericSerialBus write requires Buffer of length 66, found length 32 (20150930/exfield-418)
[31431043.575150] ACPI Error: Method parse/execution failed [\_SB.PMI0._PMM] (Node ffff883f7f89de28), AE_AML_BUFFER_LIMIT (20150930/psparse-542)
[31431043.575171] ACPI Exception: AE_AML_BUFFER_LIMIT, Evaluating _PMM (20150930/power_meter-338)
[31431093.473778] ACPI Error: SMBus/IPMI/GenericSerialBus write requires Buffer of length 66, found length 32 (20150930/exfield-418)
[31431093.473791] ACPI Error: Method parse/execution failed [\_SB.PMI0._PMM] (Node ffff883f7f89de28), AE_AML_BUFFER_LIMIT (20150930/psparse-542)
[31431093.473804] ACPI Exception: AE_AML_BUFFER_LIMIT, Evaluating _PMM (20150930/power_meter-338)
[31431103.583295] ACPI Error: SMBus/IPMI/GenericSerialBus write requires Buffer of length 66, found length 32 (20150930/exfield-418)
[31431103.583308] ACPI Error: Method parse/execution failed [\_SB.PMI0._PMM] (Node ffff883f7f89de28), AE_AML_BUFFER_LIMIT (20150930/psparse-542)
[31431103.583326] ACPI Exception: AE_AML_BUFFER_LIMIT, Evaluating _PMM (20150930/power_meter-338)
[31431153.476276] ACPI Error: SMBus/IPMI/GenericSerialBus write requires Buffer of length 66, found length 32 (20150930/exfield-418)
[31431153.476287] ACPI Error: Method parse/execution failed [\_SB.PMI0._PMM] (Node ffff883f7f89de28), AE_AML_BUFFER_LIMIT (20150930/psparse-542)
[31431153.476302] ACPI Exception: AE_AML_BUFFER_LIMIT, Evaluating _PMM (20150930/power_meter-338)
[31431163.582542] ACPI Error: SMBus/IPMI/GenericSerialBus write requires Buffer of length 66, found length 32 (20150930/exfield-418)
[31431163.582553] ACPI Error: Method parse/execution failed [\_SB.PMI0._PMM] (Node ffff883f7f89de28), AE_AML_BUFFER_LIMIT (20150930/psparse-542)
[31431163.582566] ACPI Exception: AE_AML_BUFFER_LIMIT, Evaluating _PMM (20150930/power_meter-338)
[31431213.506018] ACPI Error: SMBus/IPMI/GenericSerialBus write requires Buffer of length 66, found length 32 (20150930/exfield-418)
[31431213.506027] ACPI Error: Method parse/execution failed [\_SB.PMI0._PMM] (Node ffff883f7f89de28), AE_AML_BUFFER_LIMIT (20150930/psparse-542)
[31431213.506039] ACPI Exception: AE_AML_BUFFER_LIMIT, Evaluating _PMM (20150930/power_meter-338)
[31431223.583961] ACPI Error: SMBus/IPMI/GenericSerialBus write requires Buffer of length 66, found length 32 (20150930/exfield-418)
[31431223.583974] ACPI Error: Method parse/execution failed [\_SB.PMI0._PMM] (Node ffff883f7f89de28), AE_AML_BUFFER_LIMIT (20150930/psparse-542)
[31431223.583993] ACPI Exception: AE_AML_BUFFER_LIMIT, Evaluating _PMM (20150930/power_meter-338)
[31431273.485662] ACPI Error: SMBus/IPMI/GenericSerialBus write requires Buffer of length 66, found length 32 (20150930/exfield-418)
[31431273.485676] ACPI Error: Method parse/execution failed [\_SB.PMI0._PMM] (Node ffff883f7f89de28), AE_AML_BUFFER_LIMIT (20150930/psparse-542)
[31431273.485693] ACPI Exception: AE_AML_BUFFER_LIMIT, Evaluating _PMM (20150930/power_meter-338)
[31431283.586142] ACPI Error: SMBus/IPMI/GenericSerialBus write requires Buffer of length 66, found length 32 (20150930/exfield-418)
[31431283.586151] ACPI Error: Method parse/execution failed [\_SB.PMI0._PMM] (Node ffff883f7f89de28), AE_AML_BUFFER_LIMIT (20150930/psparse-542)
[31431283.586166] ACPI Exception: AE_AML_BUFFER_LIMIT, Evaluating _PMM (20150930/power_meter-338)
[31431333.486344] ACPI Error: SMBus/IPMI/GenericSerialBus write requires Buffer of length 66, found length 32 (20150930/exfield-418)
[31431333.486358] ACPI Error: Method parse/execution failed [\_SB.PMI0._PMM] (Node ffff883f7f89de28), AE_AML_BUFFER_LIMIT (20150930/psparse-542)
[31431333.486376] ACPI Exception: AE_AML_BUFFER_LIMIT, Evaluating _PMM (20150930/power_meter-338)
[31431343.588107] ACPI Error: SMBus/IPMI/GenericSerialBus write requires Buffer of length 66, found length 32 (20150930/exfield-418)
[31431343.588118] ACPI Error: Method parse/execution failed [\_SB.PMI0._PMM] (Node ffff883f7f89de28), AE_AML_BUFFER_LIMIT (20150930/psparse-542)
[31431343.588132] ACPI Exception: AE_AML_BUFFER_LIMIT, Evaluating _PMM (20150930/power_meter-338)
[31431393.489318] ACPI Error: SMBus/IPMI/GenericSerialBus write requires Buffer of length 66, found length 32 (20150930/exfield-418)
[31431393.489328] ACPI Error: Method parse/execution failed [\_SB.PMI0._PMM] (Node ffff883f7f89de28), AE_AML_BUFFER_LIMIT (20150930/psparse-542)
[31431393.489344] ACPI Exception: AE_AML_BUFFER_LIMIT, Evaluating _PMM (20150930/power_meter-338)
[31431403.590895] ACPI Error: SMBus/IPMI/GenericSerialBus write requires Buffer of length 66, found length 32 (20150930/exfield-418)
[31431403.590908] ACPI Error: Method parse/execution failed [\_SB.PMI0._PMM] (Node ffff883f7f89de28), AE_AML_BUFFER_LIMIT (20150930/psparse-542)
[31431403.590926] ACPI Exception: AE_AML_BUFFER_LIMIT, Evaluating _PMM (20150930/power_meter-338)
[31431453.489333] ACPI Error: SMBus/IPMI/GenericSerialBus write requires Buffer of length 66, found length 32 (20150930/exfield-418)
[31431453.489347] ACPI Error: Method parse/execution failed [\_SB.PMI0._PMM] (Node ffff883f7f89de28), AE_AML_BUFFER_LIMIT (20150930/psparse-542)
[31431453.489365] ACPI Exception: AE_AML_BUFFER_LIMIT, Evaluating _PMM (20150930/power_meter-338)
[31431463.594890] ACPI Error: SMBus/IPMI/GenericSerialBus write requires Buffer of length 66, found length 32 (20150930/exfield-418)
[31431463.594901] ACPI Error: Method parse/execution failed [\_SB.PMI0._PMM] (Node ffff883f7f89de28), AE_AML_BUFFER_LIMIT (20150930/psparse-542)
[31431463.594917] ACPI Exception: AE_AML_BUFFER_LIMIT, Evaluating _PMM (20150930/power_meter-338)
[31431513.492055] ACPI Error: SMBus/IPMI/GenericSerialBus write requires Buffer of length 66, found length 32 (20150930/exfield-418)
[31431513.492069] ACPI Error: Method parse/execution failed [\_SB.PMI0._PMM] (Node ffff883f7f89de28), AE_AML_BUFFER_LIMIT (20150930/psparse-542)
[31431513.492086] ACPI Exception: AE_AML_BUFFER_LIMIT, Evaluating _PMM (20150930/power_meter-338)
[31431523.597258] ACPI Error: SMBus/IPMI/GenericSerialBus write requires Buffer of length 66, found length 32 (20150930/exfield-418)
[31431523.597273] ACPI Error: Method parse/execution failed [\_SB.PMI0._PMM] (Node ffff883f7f89de28), AE_AML_BUFFER_LIMIT (20150930/psparse-542)
[31431523.597294] ACPI Exception: AE_AML_BUFFER_LIMIT, Evaluating _PMM (20150930/power_meter-338)
[31431573.494664] ACPI Error: SMBus/IPMI/GenericSerialBus write requires Buffer of length 66, found length 32 (20150930/exfield-418)
[31431573.494677] ACPI Error: Method parse/execution failed [\_SB.PMI0._PMM] (Node ffff883f7f89de28), AE_AML_BUFFER_LIMIT (20150930/psparse-542)
[31431573.494692] ACPI Exception: AE_AML_BUFFER_LIMIT, Evaluating _PMM (20150930/power_meter-338)
[31431583.599892] ACPI Error: SMBus/IPMI/GenericSerialBus write requires Buffer of length 66, found length 32 (20150930/exfield-418)
[31431583.599906] ACPI Error: Method parse/execution failed [\_SB.PMI0._PMM] (Node ffff883f7f89de28), AE_AML_BUFFER_LIMIT (20150930/psparse-542)
[31431583.599926] ACPI Exception: AE_AML_BUFFER_LIMIT, Evaluating _PMM (20150930/power_meter-338)
[31431633.495672] ACPI Error: SMBus/IPMI/GenericSerialBus write requires Buffer of length 66, found length 32 (20150930/exfield-418)
[31431633.495682] ACPI Error: Method parse/execution failed [\_SB.PMI0._PMM] (Node ffff883f7f89de28), AE_AML_BUFFER_LIMIT (20150930/psparse-542)
[31431633.495695] ACPI Exception: AE_AML_BUFFER_LIMIT, Evaluating _PMM (20150930/power_meter-338)
[31431643.603151] ACPI Error: SMBus/IPMI/GenericSerialBus write requires Buffer of length 66, found length 32 (20150930/exfield-418)
[31431643.603165] ACPI Error: Method parse/execution failed [\_SB.PMI0._PMM] (Node ffff883f7f89de28), AE_AML_BUFFER_LIMIT (20150930/psparse-542)
[31431643.603184] ACPI Exception: AE_AML_BUFFER_LIMIT, Evaluating _PMM (20150930/power_meter-338)
[31431693.499138] ACPI Error: SMBus/IPMI/GenericSerialBus write requires Buffer of length 66, found length 32 (20150930/exfield-418)
[31431693.499153] ACPI Error: Method parse/execution failed [\_SB.PMI0._PMM] (Node ffff883f7f89de28), AE_AML_BUFFER_LIMIT (20150930/psparse-542)
[31431693.499176] ACPI Exception: AE_AML_BUFFER_LIMIT, Evaluating _PMM (20150930/power_meter-338)
[31431703.606557] ACPI Error: SMBus/IPMI/GenericSerialBus write requires Buffer of length 66, found length 32 (20150930/exfield-418)
[31431703.606567] ACPI Error: Method parse/execution failed [\_SB.PMI0._PMM] (Node ffff883f7f89de28), AE_AML_BUFFER_LIMIT (20150930/psparse-542)
[31431703.606579] ACPI Exception: AE_AML_BUFFER_LIMIT, Evaluating _PMM (20150930/power_meter-338)
[31431753.502787] ACPI Error: SMBus/IPMI/GenericSerialBus write requires Buffer of length 66, found length 32 (20150930/exfield-418)
[31431753.502798] ACPI Error: Method parse/execution failed [\_SB.PMI0._PMM] (Node ffff883f7f89de28), AE_AML_BUFFER_LIMIT (20150930/psparse-542)
[31431753.502818] ACPI Exception: AE_AML_BUFFER_LIMIT, Evaluating _PMM (20150930/power_meter-338)
[31431763.606562] ACPI Error: SMBus/IPMI/GenericSerialBus write requires Buffer of length 66, found length 32 (20150930/exfield-418)
[31431763.606574] ACPI Error: Method parse/execution failed [\_SB.PMI0._PMM] (Node ffff883f7f89de28), AE_AML_BUFFER_LIMIT (20150930/psparse-542)
[31431763.606592] ACPI Exception: AE_AML_BUFFER_LIMIT, Evaluating _PMM (20150930/power_meter-338)
[31431813.506740] ACPI Error: SMBus/IPMI/GenericSerialBus write requires Buffer of length 66, found length 32 (20150930/exfield-418)
[31431813.506752] ACPI Error: Method parse/execution failed [\_SB.PMI0._PMM] (Node ffff883f7f89de28), AE_AML_BUFFER_LIMIT (20150930/psparse-542)
[31431813.506770] ACPI Exception: AE_AML_BUFFER_LIMIT, Evaluating _PMM (20150930/power_meter-338)
[31431823.609556] ACPI Error: SMBus/IPMI/GenericSerialBus write requires Buffer of length 66, found length 32 (20150930/exfield-418)
[31431823.609573] ACPI Error: Method parse/execution failed [\_SB.PMI0._PMM] (Node ffff883f7f89de28), AE_AML_BUFFER_LIMIT (20150930/psparse-542)
[31431823.609594] ACPI Exception: AE_AML_BUFFER_LIMIT, Evaluating _PMM (20150930/power_meter-338)
[31431873.508273] ACPI Error: SMBus/IPMI/GenericSerialBus write requires Buffer of length 66, found length 32 (20150930/exfield-418)
[31431873.508285] ACPI Error: Method parse/execution failed [\_SB.PMI0._PMM] (Node ffff883f7f89de28), AE_AML_BUFFER_LIMIT (20150930/psparse-542)
[31431873.508302] ACPI Exception: AE_AML_BUFFER_LIMIT, Evaluating _PMM (20150930/power_meter-338)
[31431883.611253] ACPI Error: SMBus/IPMI/GenericSerialBus write requires Buffer of length 66, found length 32 (20150930/exfield-418)
[31431883.611263] ACPI Error: Method parse/execution failed [\_SB.PMI0._PMM] (Node ffff883f7f89de28), AE_AML_BUFFER_LIMIT (20150930/psparse-542)
[31431883.611276] ACPI Exception: AE_AML_BUFFER_LIMIT, Evaluating _PMM (20150930/power_meter-338)
[31431933.512967] ACPI Error: SMBus/IPMI/GenericSerialBus write requires Buffer of length 66, found length 32 (20150930/exfield-418)
[31431933.512977] ACPI Error: Method parse/execution failed [\_SB.PMI0._PMM] (Node ffff883f7f89de28), AE_AML_BUFFER_LIMIT (20150930/psparse-542)
[31431933.512989] ACPI Exception: AE_AML_BUFFER_LIMIT, Evaluating _PMM (20150930/power_meter-338)
[31431943.614372] ACPI Error: SMBus/IPMI/GenericSerialBus write requires Buffer of length 66, found length 32 (20150930/exfield-418)
[31431943.614384] ACPI Error: Method parse/execution failed [\_SB.PMI0._PMM] (Node ffff883f7f89de28), AE_AML_BUFFER_LIMIT (20150930/psparse-542)
[31431943.614579] ACPI Exception: AE_AML_BUFFER_LIMIT, Evaluating _PMM (20150930/power_meter-338)
[31431993.513837] ACPI Error: SMBus/IPMI/GenericSerialBus write requires Buffer of length 66, found length 32 (20150930/exfield-418)
[31431993.513848] ACPI Error: Method parse/execution failed [\_SB.PMI0._PMM] (Node ffff883f7f89de28), AE_AML_BUFFER_LIMIT (20150930/psparse-542)
[31431993.513866] ACPI Exception: AE_AML_BUFFER_LIMIT, Evaluating _PMM (20150930/power_meter-338)
[31432003.615743] ACPI Error: SMBus/IPMI/GenericSerialBus write requires Buffer of length 66, found length 32 (20150930/exfield-418)
[31432003.615753] ACPI Error: Method parse/execution failed [\_SB.PMI0._PMM] (Node ffff883f7f89de28), AE_AML_BUFFER_LIMIT (20150930/psparse-542)
[31432003.615766] ACPI Exception: AE_AML_BUFFER_LIMIT, Evaluating _PMM (20150930/power_meter-338)
[31432053.514453] ACPI Error: SMBus/IPMI/GenericSerialBus write requires Buffer of length 66, found length 32 (20150930/exfield-418)
[31432053.514470] ACPI Error: Method parse/execution failed [\_SB.PMI0._PMM] (Node ffff883f7f89de28), AE_AML_BUFFER_LIMIT (20150930/psparse-542)
[31432053.514488] ACPI Exception: AE_AML_BUFFER_LIMIT, Evaluating _PMM (20150930/power_meter-338)
[31432063.620531] ACPI Error: SMBus/IPMI/GenericSerialBus write requires Buffer of length 66, found length 32 (20150930/exfield-418)
[31432063.620541] ACPI Error: Method parse/execution failed [\_SB.PMI0._PMM] (Node ffff883f7f89de28), AE_AML_BUFFER_LIMIT (20150930/psparse-542)
[31432063.620553] ACPI Exception: AE_AML_BUFFER_LIMIT, Evaluating _PMM (20150930/power_meter-338)
[31432113.517796] ACPI Error: SMBus/IPMI/GenericSerialBus write requires Buffer of length 66, found length 32 (20150930/exfield-418)
[31432113.517804] ACPI Error: Method parse/execution failed [\_SB.PMI0._PMM] (Node ffff883f7f89de28), AE_AML_BUFFER_LIMIT (20150930/psparse-542)
[31432113.517816] ACPI Exception: AE_AML_BUFFER_LIMIT, Evaluating _PMM (20150930/power_meter-338)
[31432123.621328] ACPI Error: SMBus/IPMI/GenericSerialBus write requires Buffer of length 66, found length 32 (20150930/exfield-418)
[31432123.621339] ACPI Error: Method parse/execution failed [\_SB.PMI0._PMM] (Node ffff883f7f89de28), AE_AML_BUFFER_LIMIT (20150930/psparse-542)
[31432123.621352] ACPI Exception: AE_AML_BUFFER_LIMIT, Evaluating _PMM (20150930/power_meter-338)
[31432173.521917] ACPI Error: SMBus/IPMI/GenericSerialBus write requires Buffer of length 66, found length 32 (20150930/exfield-418)
[31432173.521932] ACPI Error: Method parse/execution failed [\_SB.PMI0._PMM] (Node ffff883f7f89de28), AE_AML_BUFFER_LIMIT (20150930/psparse-542)
[31432173.521951] ACPI Exception: AE_AML_BUFFER_LIMIT, Evaluating _PMM (20150930/power_meter-338)
[31432183.623758] ACPI Error: SMBus/IPMI/GenericSerialBus write requires Buffer of length 66, found length 32 (20150930/exfield-418)
[31432183.623767] ACPI Error: Method parse/execution failed [\_SB.PMI0._PMM] (Node ffff883f7f89de28), AE_AML_BUFFER_LIMIT (20150930/psparse-542)
[31432183.623781] ACPI Exception: AE_AML_BUFFER_LIMIT, Evaluating _PMM (20150930/power_meter-338)
[31432233.527965] ACPI Error: SMBus/IPMI/GenericSerialBus write requires Buffer of length 66, found length 32 (20150930/exfield-418)
[31432233.527977] ACPI Error: Method parse/execution failed [\_SB.PMI0._PMM] (Node ffff883f7f89de28), AE_AML_BUFFER_LIMIT (20150930/psparse-542)
[31432233.527993] ACPI Exception: AE_AML_BUFFER_LIMIT, Evaluating _PMM (20150930/power_meter-338)
[31432243.626420] ACPI Error: SMBus/IPMI/GenericSerialBus write requires Buffer of length 66, found length 32 (20150930/exfield-418)
[31432243.626429] ACPI Error: Method parse/execution failed [\_SB.PMI0._PMM] (Node ffff883f7f89de28), AE_AML_BUFFER_LIMIT (20150930/psparse-542)
[31432243.626442] ACPI Exception: AE_AML_BUFFER_LIMIT, Evaluating _PMM (20150930/power_meter-338)
[31432293.526406] ACPI Error: SMBus/IPMI/GenericSerialBus write requires Buffer of length 66, found length 32 (20150930/exfield-418)
[31432293.526418] ACPI Error: Method parse/execution failed [\_SB.PMI0._PMM] (Node ffff883f7f89de28), AE_AML_BUFFER_LIMIT (20150930/psparse-542)
[31432293.526436] ACPI Exception: AE_AML_BUFFER_LIMIT, Evaluating _PMM (20150930/power_meter-338)
[31432303.629648] ACPI Error: SMBus/IPMI/GenericSerialBus write requires Buffer of length 66, found length 32 (20150930/exfield-418)
[31432303.629663] ACPI Error: Method parse/execution failed [\_SB.PMI0._PMM] (Node ffff883f7f89de28), AE_AML_BUFFER_LIMIT (20150930/psparse-542)
[31432303.629680] ACPI Exception: AE_AML_BUFFER_LIMIT, Evaluating _PMM (20150930/power_meter-338)
[31432353.527831] ACPI Error: SMBus/IPMI/GenericSerialBus write requires Buffer of length 66, found length 32 (20150930/exfield-418)
[31432353.527842] ACPI Error: Method parse/execution failed [\_SB.PMI0._PMM] (Node ffff883f7f89de28), AE_AML_BUFFER_LIMIT (20150930/psparse-542)
[31432353.527855] ACPI Exception: AE_AML_BUFFER_LIMIT, Evaluating _PMM (20150930/power_meter-338)
[31432363.634049] ACPI Error: SMBus/IPMI/GenericSerialBus write requires Buffer of length 66, found length 32 (20150930/exfield-418)
[31432363.634060] ACPI Error: Method parse/execution failed [\_SB.PMI0._PMM] (Node ffff883f7f89de28), AE_AML_BUFFER_LIMIT (20150930/psparse-542)
[31432363.634077] ACPI Exception: AE_AML_BUFFER_LIMIT, Evaluating _PMM (20150930/power_meter-338)
[31432413.529572] ACPI Error: SMBus/IPMI/GenericSerialBus write requires Buffer of length 66, found length 32 (20150930/exfield-418)
[31432413.529587] ACPI Error: Method parse/execution failed [\_SB.PMI0._PMM] (Node ffff883f7f89de28), AE_AML_BUFFER_LIMIT (20150930/psparse-542)
[31432413.529606] ACPI Exception: AE_AML_BUFFER_LIMIT, Evaluating _PMM (20150930/power_meter-338)
[31432423.803415] ACPI Error: SMBus/IPMI/GenericSerialBus write requires Buffer of length 66, found length 32 (20150930/exfield-418)
[31432423.803429] ACPI Error: Method parse/execution failed [\_SB.PMI0._PMM] (Node ffff883f7f89de28), AE_AML_BUFFER_LIMIT (20150930/psparse-542)
[31432423.803447] ACPI Exception: AE_AML_BUFFER_LIMIT, Evaluating _PMM (20150930/power_meter-338)
[31432473.532579] ACPI Error: SMBus/IPMI/GenericSerialBus write requires Buffer of length 66, found length 32 (20150930/exfield-418)
[31432473.532592] ACPI Error: Method parse/execution failed [\_SB.PMI0._PMM] (Node ffff883f7f89de28), AE_AML_BUFFER_LIMIT (20150930/psparse-542)
[31432473.532610] ACPI Exception: AE_AML_BUFFER_LIMIT, Evaluating _PMM (20150930/power_meter-338)
[31432483.637983] ACPI Error: SMBus/IPMI/GenericSerialBus write requires Buffer of length 66, found length 32 (20150930/exfield-418)
[31432483.637996] ACPI Error: Method parse/execution failed [\_SB.PMI0._PMM] (Node ffff883f7f89de28), AE_AML_BUFFER_LIMIT (20150930/psparse-542)
[31432483.638011] ACPI Exception: AE_AML_BUFFER_LIMIT, Evaluating _PMM (20150930/power_meter-338)
[31432533.537484] ACPI Error: SMBus/IPMI/GenericSerialBus write requires Buffer of length 66, found length 32 (20150930/exfield-418)
[31432533.537495] ACPI Error: Method parse/execution failed [\_SB.PMI0._PMM] (Node ffff883f7f89de28), AE_AML_BUFFER_LIMIT (20150930/psparse-542)
[31432533.537508] ACPI Exception: AE_AML_BUFFER_LIMIT, Evaluating _PMM (20150930/power_meter-338)
[31432543.639751] ACPI Error: SMBus/IPMI/GenericSerialBus write requires Buffer of length 66, found length 32 (20150930/exfield-418)
[31432543.639764] ACPI Error: Method parse/execution failed [\_SB.PMI0._PMM] (Node ffff883f7f89de28), AE_AML_BUFFER_LIMIT (20150930/psparse-542)
[31432543.639784] ACPI Exception: AE_AML_BUFFER_LIMIT, Evaluating _PMM (20150930/power_meter-338)
[31432593.538905] ACPI Error: SMBus/IPMI/GenericSerialBus write requires Buffer of length 66, found length 32 (20150930/exfield-418)
[31432593.538918] ACPI Error: Method parse/execution failed [\_SB.PMI0._PMM] (Node ffff883f7f89de28), AE_AML_BUFFER_LIMIT (20150930/psparse-542)
[31432593.538935] ACPI Exception: AE_AML_BUFFER_LIMIT, Evaluating _PMM (20150930/power_meter-338)
[31432603.642484] ACPI Error: SMBus/IPMI/GenericSerialBus write requires Buffer of length 66, found length 32 (20150930/exfield-418)
[31432603.642496] ACPI Error: Method parse/execution failed [\_SB.PMI0._PMM] (Node ffff883f7f89de28), AE_AML_BUFFER_LIMIT (20150930/psparse-542)
[31432603.642514] ACPI Exception: AE_AML_BUFFER_LIMIT, Evaluating _PMM (20150930/power_meter-338)
[31432653.542707] ACPI Error: SMBus/IPMI/GenericSerialBus write requires Buffer of length 66, found length 32 (20150930/exfield-418)
[31432653.542719] ACPI Error: Method parse/execution failed [\_SB.PMI0._PMM] (Node ffff883f7f89de28), AE_AML_BUFFER_LIMIT (20150930/psparse-542)
[31432653.542735] ACPI Exception: AE_AML_BUFFER_LIMIT, Evaluating _PMM (20150930/power_meter-338)
[31432663.646180] ACPI Error: SMBus/IPMI/GenericSerialBus write requires Buffer of length 66, found length 32 (20150930/exfield-418)
[31432663.646190] ACPI Error: Method parse/execution failed [\_SB.PMI0._PMM] (Node ffff883f7f89de28), AE_AML_BUFFER_LIMIT (20150930/psparse-542)
[31432663.646205] ACPI Exception: AE_AML_BUFFER_LIMIT, Evaluating _PMM (20150930/power_meter-338)
[31432713.545058] ACPI Error: SMBus/IPMI/GenericSerialBus write requires Buffer of length 66, found length 32 (20150930/exfield-418)
[31432713.545067] ACPI Error: Method parse/execution failed [\_SB.PMI0._PMM] (Node ffff883f7f89de28), AE_AML_BUFFER_LIMIT (20150930/psparse-542)
[31432713.545080] ACPI Exception: AE_AML_BUFFER_LIMIT, Evaluating _PMM (20150930/power_meter-338)
[31432723.647286] ACPI Error: SMBus/IPMI/GenericSerialBus write requires Buffer of length 66, found length 32 (20150930/exfield-418)
[31432723.647296] ACPI Error: Method parse/execution failed [\_SB.PMI0._PMM] (Node ffff883f7f89de28), AE_AML_BUFFER_LIMIT (20150930/psparse-542)
[31432723.647309] ACPI Exception: AE_AML_BUFFER_LIMIT, Evaluating _PMM (20150930/power_meter-338)
[31432773.545232] ACPI Error: SMBus/IPMI/GenericSerialBus write requires Buffer of length 66, found length 32 (20150930/exfield-418)
[31432773.545246] ACPI Error: Method parse/execution failed [\_SB.PMI0._PMM] (Node ffff883f7f89de28), AE_AML_BUFFER_LIMIT (20150930/psparse-542)
[31432773.545266] ACPI Exception: AE_AML_BUFFER_LIMIT, Evaluating _PMM (20150930/power_meter-338)
[31432783.651950] ACPI Error: SMBus/IPMI/GenericSerialBus write requires Buffer of length 66, found length 32 (20150930/exfield-418)
[31432783.651959] ACPI Error: Method parse/execution failed [\_SB.PMI0._PMM] (Node ffff883f7f89de28), AE_AML_BUFFER_LIMIT (20150930/psparse-542)
[31432783.651971] ACPI Exception: AE_AML_BUFFER_LIMIT, Evaluating _PMM (20150930/power_meter-338)
[31432833.548027] ACPI Error: SMBus/IPMI/GenericSerialBus write requires Buffer of length 66, found length 32 (20150930/exfield-418)
[31432833.548040] ACPI Error: Method parse/execution failed [\_SB.PMI0._PMM] (Node ffff883f7f89de28), AE_AML_BUFFER_LIMIT (20150930/psparse-542)
[31432833.548058] ACPI Exception: AE_AML_BUFFER_LIMIT, Evaluating _PMM (20150930/power_meter-338)
[31432843.654359] ACPI Error: SMBus/IPMI/GenericSerialBus write requires Buffer of length 66, found length 32 (20150930/exfield-418)
[31432843.654367] ACPI Error: Method parse/execution failed [\_SB.PMI0._PMM] (Node ffff883f7f89de28), AE_AML_BUFFER_LIMIT (20150930/psparse-542)
[31432843.654379] ACPI Exception: AE_AML_BUFFER_LIMIT, Evaluating _PMM (20150930/power_meter-338)
[31432893.551705] ACPI Error: SMBus/IPMI/GenericSerialBus write requires Buffer of length 66, found length 32 (20150930/exfield-418)
[31432893.551721] ACPI Error: Method parse/execution failed [\_SB.PMI0._PMM] (Node ffff883f7f89de28), AE_AML_BUFFER_LIMIT (20150930/psparse-542)
[31432893.551742] ACPI Exception: AE_AML_BUFFER_LIMIT, Evaluating _PMM (20150930/power_meter-338)
[31432903.655586] ACPI Error: SMBus/IPMI/GenericSerialBus write requires Buffer of length 66, found length 32 (20150930/exfield-418)
[31432903.655599] ACPI Error: Method parse/execution failed [\_SB.PMI0._PMM] (Node ffff883f7f89de28), AE_AML_BUFFER_LIMIT (20150930/psparse-542)
[31432903.655618] ACPI Exception: AE_AML_BUFFER_LIMIT, Evaluating _PMM (20150930/power_meter-338)
[31432953.553316] ACPI Error: SMBus/IPMI/GenericSerialBus write requires Buffer of length 66, found length 32 (20150930/exfield-418)
[31432953.553330] ACPI Error: Method parse/execution failed [\_SB.PMI0._PMM] (Node ffff883f7f89de28), AE_AML_BUFFER_LIMIT (20150930/psparse-542)
[31432953.553350] ACPI Exception: AE_AML_BUFFER_LIMIT, Evaluating _PMM (20150930/power_meter-338)
[31432963.657780] ACPI Error: SMBus/IPMI/GenericSerialBus write requires Buffer of length 66, found length 32 (20150930/exfield-418)
[31432963.657790] ACPI Error: Method parse/execution failed [\_SB.PMI0._PMM] (Node ffff883f7f89de28), AE_AML_BUFFER_LIMIT (20150930/psparse-542)
[31432963.657803] ACPI Exception: AE_AML_BUFFER_LIMIT, Evaluating _PMM (20150930/power_meter-338)
[31433013.616546] ACPI Error: SMBus/IPMI/GenericSerialBus write requires Buffer of length 66, found length 32 (20150930/exfield-418)
[31433013.616558] ACPI Error: Method parse/execution failed [\_SB.PMI0._PMM] (Node ffff883f7f89de28), AE_AML_BUFFER_LIMIT (20150930/psparse-542)
[31433013.616576] ACPI Exception: AE_AML_BUFFER_LIMIT, Evaluating _PMM (20150930/power_meter-338)
[31433023.659542] ACPI Error: SMBus/IPMI/GenericSerialBus write requires Buffer of length 66, found length 32 (20150930/exfield-418)
[31433023.659553] ACPI Error: Method parse/execution failed [\_SB.PMI0._PMM] (Node ffff883f7f89de28), AE_AML_BUFFER_LIMIT (20150930/psparse-542)
[31433023.659566] ACPI Exception: AE_AML_BUFFER_LIMIT, Evaluating _PMM (20150930/power_meter-338)
[31433073.558438] ACPI Error: SMBus/IPMI/GenericSerialBus write requires Buffer of length 66, found length 32 (20150930/exfield-418)
[31433073.558450] ACPI Error: Method parse/execution failed [\_SB.PMI0._PMM] (Node ffff883f7f89de28), AE_AML_BUFFER_LIMIT (20150930/psparse-542)
[31433073.558467] ACPI Exception: AE_AML_BUFFER_LIMIT, Evaluating _PMM (20150930/power_meter-338)
[31433083.665549] ACPI Error: SMBus/IPMI/GenericSerialBus write requires Buffer of length 66, found length 32 (20150930/exfield-418)
[31433083.665563] ACPI Error: Method parse/execution failed [\_SB.PMI0._PMM] (Node ffff883f7f89de28), AE_AML_BUFFER_LIMIT (20150930/psparse-542)
[31433083.665582] ACPI Exception: AE_AML_BUFFER_LIMIT, Evaluating _PMM (20150930/power_meter-338)
[31433133.561021] ACPI Error: SMBus/IPMI/GenericSerialBus write requires Buffer of length 66, found length 32 (20150930/exfield-418)
[31433133.561035] ACPI Error: Method parse/execution failed [\_SB.PMI0._PMM] (Node ffff883f7f89de28), AE_AML_BUFFER_LIMIT (20150930/psparse-542)
[31433133.561055] ACPI Exception: AE_AML_BUFFER_LIMIT, Evaluating _PMM (20150930/power_meter-338)
[31433143.666447] ACPI Error: SMBus/IPMI/GenericSerialBus write requires Buffer of length 66, found length 32 (20150930/exfield-418)
[31433143.666457] ACPI Error: Method parse/execution failed [\_SB.PMI0._PMM] (Node ffff883f7f89de28), AE_AML_BUFFER_LIMIT (20150930/psparse-542)
[31433143.666470] ACPI Exception: AE_AML_BUFFER_LIMIT, Evaluating _PMM (20150930/power_meter-338)
[31433193.563377] ACPI Error: SMBus/IPMI/GenericSerialBus write requires Buffer of length 66, found length 32 (20150930/exfield-418)
[31433193.563399] ACPI Error: Method parse/execution failed [\_SB.PMI0._PMM] (Node ffff883f7f89de28), AE_AML_BUFFER_LIMIT (20150930/psparse-542)
[31433193.563411] ACPI Exception: AE_AML_BUFFER_LIMIT, Evaluating _PMM (20150930/power_meter-338)
[31433203.667803] ACPI Error: SMBus/IPMI/GenericSerialBus write requires Buffer of length 66, found length 32 (20150930/exfield-418)
[31433203.667816] ACPI Error: Method parse/execution failed [\_SB.PMI0._PMM] (Node ffff883f7f89de28), AE_AML_BUFFER_LIMIT (20150930/psparse-542)
[31433203.667833] ACPI Exception: AE_AML_BUFFER_LIMIT, Evaluating _PMM (20150930/power_meter-338)
[31433253.567384] ACPI Error: SMBus/IPMI/GenericSerialBus write requires Buffer of length 66, found length 32 (20150930/exfield-418)
[31433253.567395] ACPI Error: Method parse/execution failed [\_SB.PMI0._PMM] (Node ffff883f7f89de28), AE_AML_BUFFER_LIMIT (20150930/psparse-542)
[31433253.567410] ACPI Exception: AE_AML_BUFFER_LIMIT, Evaluating _PMM (20150930/power_meter-338)
[31433263.670748] ACPI Error: SMBus/IPMI/GenericSerialBus write requires Buffer of length 66, found length 32 (20150930/exfield-418)
[31433263.670757] ACPI Error: Method parse/execution failed [\_SB.PMI0._PMM] (Node ffff883f7f89de28), AE_AML_BUFFER_LIMIT (20150930/psparse-542)
[31433263.670769] ACPI Exception: AE_AML_BUFFER_LIMIT, Evaluating _PMM (20150930/power_meter-338)
[31433313.569623] ACPI Error: SMBus/IPMI/GenericSerialBus write requires Buffer of length 66, found length 32 (20150930/exfield-418)
[31433313.569636] ACPI Error: Method parse/execution failed [\_SB.PMI0._PMM] (Node ffff883f7f89de28), AE_AML_BUFFER_LIMIT (20150930/psparse-542)
[31433313.569655] ACPI Exception: AE_AML_BUFFER_LIMIT, Evaluating _PMM (20150930/power_meter-338)
[31433323.674459] ACPI Error: SMBus/IPMI/GenericSerialBus write requires Buffer of length 66, found length 32 (20150930/exfield-418)
[31433323.674468] ACPI Error: Method parse/execution failed [\_SB.PMI0._PMM] (Node ffff883f7f89de28), AE_AML_BUFFER_LIMIT (20150930/psparse-542)
[31433323.674479] ACPI Exception: AE_AML_BUFFER_LIMIT, Evaluating _PMM (20150930/power_meter-338)
[31433373.572307] ACPI Error: SMBus/IPMI/GenericSerialBus write requires Buffer of length 66, found length 32 (20150930/exfield-418)
[31433373.572316] ACPI Error: Method parse/execution failed [\_SB.PMI0._PMM] (Node ffff883f7f89de28), AE_AML_BUFFER_LIMIT (20150930/psparse-542)
[31433373.572328] ACPI Exception: AE_AML_BUFFER_LIMIT, Evaluating _PMM (20150930/power_meter-338)
[31433383.675281] ACPI Error: SMBus/IPMI/GenericSerialBus write requires Buffer of length 66, found length 32 (20150930/exfield-418)
[31433383.675291] ACPI Error: Method parse/execution failed [\_SB.PMI0._PMM] (Node ffff883f7f89de28), AE_AML_BUFFER_LIMIT (20150930/psparse-542)
[31433383.675304] ACPI Exception: AE_AML_BUFFER_LIMIT, Evaluating _PMM (20150930/power_meter-338)
[31433433.574126] ACPI Error: SMBus/IPMI/GenericSerialBus write requires Buffer of length 66, found length 32 (20150930/exfield-418)
[31433433.574135] ACPI Error: Method parse/execution failed [\_SB.PMI0._PMM] (Node ffff883f7f89de28), AE_AML_BUFFER_LIMIT (20150930/psparse-542)
[31433433.574147] ACPI Exception: AE_AML_BUFFER_LIMIT, Evaluating _PMM (20150930/power_meter-338)
[31433443.677999] ACPI Error: SMBus/IPMI/GenericSerialBus write requires Buffer of length 66, found length 32 (20150930/exfield-418)
[31433443.678014] ACPI Error: Method parse/execution failed [\_SB.PMI0._PMM] (Node ffff883f7f89de28), AE_AML_BUFFER_LIMIT (20150930/psparse-542)
[31433443.678034] ACPI Exception: AE_AML_BUFFER_LIMIT, Evaluating _PMM (20150930/power_meter-338)
[31433493.577514] ACPI Error: SMBus/IPMI/GenericSerialBus write requires Buffer of length 66, found length 32 (20150930/exfield-418)
[31433493.577526] ACPI Error: Method parse/execution failed [\_SB.PMI0._PMM] (Node ffff883f7f89de28), AE_AML_BUFFER_LIMIT (20150930/psparse-542)
[31433493.577542] ACPI Exception: AE_AML_BUFFER_LIMIT, Evaluating _PMM (20150930/power_meter-338)
[31433503.679874] ACPI Error: SMBus/IPMI/GenericSerialBus write requires Buffer of length 66, found length 32 (20150930/exfield-418)
[31433503.679884] ACPI Error: Method parse/execution failed [\_SB.PMI0._PMM] (Node ffff883f7f89de28), AE_AML_BUFFER_LIMIT (20150930/psparse-542)
[31433503.679901] ACPI Exception: AE_AML_BUFFER_LIMIT, Evaluating _PMM (20150930/power_meter-338)
[31433553.579853] ACPI Error: SMBus/IPMI/GenericSerialBus write requires Buffer of length 66, found length 32 (20150930/exfield-418)
[31433553.579864] ACPI Error: Method parse/execution failed [\_SB.PMI0._PMM] (Node ffff883f7f89de28), AE_AML_BUFFER_LIMIT (20150930/psparse-542)
[31433553.579877] ACPI Exception: AE_AML_BUFFER_LIMIT, Evaluating _PMM (20150930/power_meter-338)
[31433563.684253] ACPI Error: SMBus/IPMI/GenericSerialBus write requires Buffer of length 66, found length 32 (20150930/exfield-418)
[31433563.684266] ACPI Error: Method parse/execution failed [\_SB.PMI0._PMM] (Node ffff883f7f89de28), AE_AML_BUFFER_LIMIT (20150930/psparse-542)
[31433563.684283] ACPI Exception: AE_AML_BUFFER_LIMIT, Evaluating _PMM (20150930/power_meter-338)
[31433613.582128] ACPI Error: SMBus/IPMI/GenericSerialBus write requires Buffer of length 66, found length 32 (20150930/exfield-418)
[31433613.582137] ACPI Error: Method parse/execution failed [\_SB.PMI0._PMM] (Node ffff883f7f89de28), AE_AML_BUFFER_LIMIT (20150930/psparse-542)
[31433613.582149] ACPI Exception: AE_AML_BUFFER_LIMIT, Evaluating _PMM (20150930/power_meter-338)
[31433623.684303] ACPI Error: SMBus/IPMI/GenericSerialBus write requires Buffer of length 66, found length 32 (20150930/exfield-418)
[31433623.684317] ACPI Error: Method parse/execution failed [\_SB.PMI0._PMM] (Node ffff883f7f89de28), AE_AML_BUFFER_LIMIT (20150930/psparse-542)
[31433623.684338] ACPI Exception: AE_AML_BUFFER_LIMIT, Evaluating _PMM (20150930/power_meter-338)
[31433673.584606] ACPI Error: SMBus/IPMI/GenericSerialBus write requires Buffer of length 66, found length 32 (20150930/exfield-418)
[31433673.584619] ACPI Error: Method parse/execution failed [\_SB.PMI0._PMM] (Node ffff883f7f89de28), AE_AML_BUFFER_LIMIT (20150930/psparse-542)
[31433673.584637] ACPI Exception: AE_AML_BUFFER_LIMIT, Evaluating _PMM (20150930/power_meter-338)
[31433683.687016] ACPI Error: SMBus/IPMI/GenericSerialBus write requires Buffer of length 66, found length 32 (20150930/exfield-418)
[31433683.687025] ACPI Error: Method parse/execution failed [\_SB.PMI0._PMM] (Node ffff883f7f89de28), AE_AML_BUFFER_LIMIT (20150930/psparse-542)
[31433683.687037] ACPI Exception: AE_AML_BUFFER_LIMIT, Evaluating _PMM (20150930/power_meter-338)
[31433733.585342] ACPI Error: SMBus/IPMI/GenericSerialBus write requires Buffer of length 66, found length 32 (20150930/exfield-418)
[31433733.585355] ACPI Error: Method parse/execution failed [\_SB.PMI0._PMM] (Node ffff883f7f89de28), AE_AML_BUFFER_LIMIT (20150930/psparse-542)
[31433733.585373] ACPI Exception: AE_AML_BUFFER_LIMIT, Evaluating _PMM (20150930/power_meter-338)
[31433743.691735] ACPI Error: SMBus/IPMI/GenericSerialBus write requires Buffer of length 66, found length 32 (20150930/exfield-418)
[31433743.691747] ACPI Error: Method parse/execution failed [\_SB.PMI0._PMM] (Node ffff883f7f89de28), AE_AML_BUFFER_LIMIT (20150930/psparse-542)
[31433743.691764] ACPI Exception: AE_AML_BUFFER_LIMIT, Evaluating _PMM (20150930/power_meter-338)
[31433793.590331] ACPI Error: SMBus/IPMI/GenericSerialBus write requires Buffer of length 66, found length 32 (20150930/exfield-418)
[31433793.590342] ACPI Error: Method parse/execution failed [\_SB.PMI0._PMM] (Node ffff883f7f89de28), AE_AML_BUFFER_LIMIT (20150930/psparse-542)
[31433793.590357] ACPI Exception: AE_AML_BUFFER_LIMIT, Evaluating _PMM (20150930/power_meter-338)
[31433803.693566] ACPI Error: SMBus/IPMI/GenericSerialBus write requires Buffer of length 66, found length 32 (20150930/exfield-418)
[31433803.693576] ACPI Error: Method parse/execution failed [\_SB.PMI0._PMM] (Node ffff883f7f89de28), AE_AML_BUFFER_LIMIT (20150930/psparse-542)
[31433803.693589] ACPI Exception: AE_AML_BUFFER_LIMIT, Evaluating _PMM (20150930/power_meter-338)
[31433853.615573] ACPI Error: SMBus/IPMI/GenericSerialBus write requires Buffer of length 66, found length 32 (20150930/exfield-418)
[31433853.615587] ACPI Error: Method parse/execution failed [\_SB.PMI0._PMM] (Node ffff883f7f89de28), AE_AML_BUFFER_LIMIT (20150930/psparse-542)
[31433853.615607] ACPI Exception: AE_AML_BUFFER_LIMIT, Evaluating _PMM (20150930/power_meter-338)
[31433863.697031] ACPI Error: SMBus/IPMI/GenericSerialBus write requires Buffer of length 66, found length 32 (20150930/exfield-418)
[31433863.697041] ACPI Error: Method parse/execution failed [\_SB.PMI0._PMM] (Node ffff883f7f89de28), AE_AML_BUFFER_LIMIT (20150930/psparse-542)
[31433863.697054] ACPI Exception: AE_AML_BUFFER_LIMIT, Evaluating _PMM (20150930/power_meter-338)
[31433913.596132] ACPI Error: SMBus/IPMI/GenericSerialBus write requires Buffer of length 66, found length 32 (20150930/exfield-418)
[31433913.596142] ACPI Error: Method parse/execution failed [\_SB.PMI0._PMM] (Node ffff883f7f89de28), AE_AML_BUFFER_LIMIT (20150930/psparse-542)
[31433913.596155] ACPI Exception: AE_AML_BUFFER_LIMIT, Evaluating _PMM (20150930/power_meter-338)
[31433923.697353] ACPI Error: SMBus/IPMI/GenericSerialBus write requires Buffer of length 66, found length 32 (20150930/exfield-418)
[31433923.697368] ACPI Error: Method parse/execution failed [\_SB.PMI0._PMM] (Node ffff883f7f89de28), AE_AML_BUFFER_LIMIT (20150930/psparse-542)
[31433923.697388] ACPI Exception: AE_AML_BUFFER_LIMIT, Evaluating _PMM (20150930/power_meter-338)
[31433973.599246] ACPI Error: SMBus/IPMI/GenericSerialBus write requires Buffer of length 66, found length 32 (20150930/exfield-418)
[31433973.599259] ACPI Error: Method parse/execution failed [\_SB.PMI0._PMM] (Node ffff883f7f89de28), AE_AML_BUFFER_LIMIT (20150930/psparse-542)
[31433973.599275] ACPI Exception: AE_AML_BUFFER_LIMIT, Evaluating _PMM (20150930/power_meter-338)
[31433983.700973] ACPI Error: SMBus/IPMI/GenericSerialBus write requires Buffer of length 66, found length 32 (20150930/exfield-418)
[31433983.700984] ACPI Error: Method parse/execution failed [\_SB.PMI0._PMM] (Node ffff883f7f89de28), AE_AML_BUFFER_LIMIT (20150930/psparse-542)
[31433983.700999] ACPI Exception: AE_AML_BUFFER_LIMIT, Evaluating _PMM (20150930/power_meter-338)
[31434033.601073] ACPI Error: SMBus/IPMI/GenericSerialBus write requires Buffer of length 66, found length 32 (20150930/exfield-418)
[31434033.601083] ACPI Error: Method parse/execution failed [\_SB.PMI0._PMM] (Node ffff883f7f89de28), AE_AML_BUFFER_LIMIT (20150930/psparse-542)
[31434033.601096] ACPI Exception: AE_AML_BUFFER_LIMIT, Evaluating _PMM (20150930/power_meter-338)
[31434043.705584] ACPI Error: SMBus/IPMI/GenericSerialBus write requires Buffer of length 66, found length 32 (20150930/exfield-418)
[31434043.705598] ACPI Error: Method parse/execution failed [\_SB.PMI0._PMM] (Node ffff883f7f89de28), AE_AML_BUFFER_LIMIT (20150930/psparse-542)
[31434043.705618] ACPI Exception: AE_AML_BUFFER_LIMIT, Evaluating _PMM (20150930/power_meter-338)
[31434093.602343] ACPI Error: SMBus/IPMI/GenericSerialBus write requires Buffer of length 66, found length 32 (20150930/exfield-418)
[31434093.602353] ACPI Error: Method parse/execution failed [\_SB.PMI0._PMM] (Node ffff883f7f89de28), AE_AML_BUFFER_LIMIT (20150930/psparse-542)
[31434093.602368] ACPI Exception: AE_AML_BUFFER_LIMIT, Evaluating _PMM (20150930/power_meter-338)
[31434103.707809] ACPI Error: SMBus/IPMI/GenericSerialBus write requires Buffer of length 66, found length 32 (20150930/exfield-418)
[31434103.707821] ACPI Error: Method parse/execution failed [\_SB.PMI0._PMM] (Node ffff883f7f89de28), AE_AML_BUFFER_LIMIT (20150930/psparse-542)
[31434103.707837] ACPI Exception: AE_AML_BUFFER_LIMIT, Evaluating _PMM (20150930/power_meter-338)
[31434153.605446] ACPI Error: SMBus/IPMI/GenericSerialBus write requires Buffer of length 66, found length 32 (20150930/exfield-418)
[31434153.605460] ACPI Error: Method parse/execution failed [\_SB.PMI0._PMM] (Node ffff883f7f89de28), AE_AML_BUFFER_LIMIT (20150930/psparse-542)
[31434153.605478] ACPI Exception: AE_AML_BUFFER_LIMIT, Evaluating _PMM (20150930/power_meter-338)
[31434163.708615] ACPI Error: SMBus/IPMI/GenericSerialBus write requires Buffer of length 66, found length 32 (20150930/exfield-418)
[31434163.708630] ACPI Error: Method parse/execution failed [\_SB.PMI0._PMM] (Node ffff883f7f89de28), AE_AML_BUFFER_LIMIT (20150930/psparse-542)
[31434163.708647] ACPI Exception: AE_AML_BUFFER_LIMIT, Evaluating _PMM (20150930/power_meter-338)
[31434213.608710] ACPI Error: SMBus/IPMI/GenericSerialBus write requires Buffer of length 66, found length 32 (20150930/exfield-418)
[31434213.608723] ACPI Error: Method parse/execution failed [\_SB.PMI0._PMM] (Node ffff883f7f89de28), AE_AML_BUFFER_LIMIT (20150930/psparse-542)
[31434213.608739] ACPI Exception: AE_AML_BUFFER_LIMIT, Evaluating _PMM (20150930/power_meter-338)
[31434223.711570] ACPI Error: SMBus/IPMI/GenericSerialBus write requires Buffer of length 66, found length 32 (20150930/exfield-418)
[31434223.711592] ACPI Error: Method parse/execution failed [\_SB.PMI0._PMM] (Node ffff883f7f89de28), AE_AML_BUFFER_LIMIT (20150930/psparse-542)
[31434223.711610] ACPI Exception: AE_AML_BUFFER_LIMIT, Evaluating _PMM (20150930/power_meter-338)
[31434273.608930] ACPI Error: SMBus/IPMI/GenericSerialBus write requires Buffer of length 66, found length 32 (20150930/exfield-418)
[31434273.608943] ACPI Error: Method parse/execution failed [\_SB.PMI0._PMM] (Node ffff883f7f89de28), AE_AML_BUFFER_LIMIT (20150930/psparse-542)
[31434273.608963] ACPI Exception: AE_AML_BUFFER_LIMIT, Evaluating _PMM (20150930/power_meter-338)
[31434283.716501] ACPI Error: SMBus/IPMI/GenericSerialBus write requires Buffer of length 66, found length 32 (20150930/exfield-418)
[31434283.716512] ACPI Error: Method parse/execution failed [\_SB.PMI0._PMM] (Node ffff883f7f89de28), AE_AML_BUFFER_LIMIT (20150930/psparse-542)
[31434283.716526] ACPI Exception: AE_AML_BUFFER_LIMIT, Evaluating _PMM (20150930/power_meter-338)
[31434333.613406] ACPI Error: SMBus/IPMI/GenericSerialBus write requires Buffer of length 66, found length 32 (20150930/exfield-418)
[31434333.613418] ACPI Error: Method parse/execution failed [\_SB.PMI0._PMM] (Node ffff883f7f89de28), AE_AML_BUFFER_LIMIT (20150930/psparse-542)
[31434333.613434] ACPI Exception: AE_AML_BUFFER_LIMIT, Evaluating _PMM (20150930/power_meter-338)
[31434343.719397] ACPI Error: SMBus/IPMI/GenericSerialBus write requires Buffer of length 66, found length 32 (20150930/exfield-418)
[31434343.719407] ACPI Error: Method parse/execution failed [\_SB.PMI0._PMM] (Node ffff883f7f89de28), AE_AML_BUFFER_LIMIT (20150930/psparse-542)
[31434343.719419] ACPI Exception: AE_AML_BUFFER_LIMIT, Evaluating _PMM (20150930/power_meter-338)
[31434393.614776] ACPI Error: SMBus/IPMI/GenericSerialBus write requires Buffer of length 66, found length 32 (20150930/exfield-418)
[31434393.614790] ACPI Error: Method parse/execution failed [\_SB.PMI0._PMM] (Node ffff883f7f89de28), AE_AML_BUFFER_LIMIT (20150930/psparse-542)
[31434393.614811] ACPI Exception: AE_AML_BUFFER_LIMIT, Evaluating _PMM (20150930/power_meter-338)
[31434403.717597] ACPI Error: SMBus/IPMI/GenericSerialBus write requires Buffer of length 66, found length 32 (20150930/exfield-418)
[31434403.717611] ACPI Error: Method parse/execution failed [\_SB.PMI0._PMM] (Node ffff883f7f89de28), AE_AML_BUFFER_LIMIT (20150930/psparse-542)
[31434403.717630] ACPI Exception: AE_AML_BUFFER_LIMIT, Evaluating _PMM (20150930/power_meter-338)
[31434453.619602] ACPI Error: SMBus/IPMI/GenericSerialBus write requires Buffer of length 66, found length 32 (20150930/exfield-418)
[31434453.619614] ACPI Error: Method parse/execution failed [\_SB.PMI0._PMM] (Node ffff883f7f89de28), AE_AML_BUFFER_LIMIT (20150930/psparse-542)
[31434453.619628] ACPI Exception: AE_AML_BUFFER_LIMIT, Evaluating _PMM (20150930/power_meter-338)
[31434463.721496] ACPI Error: SMBus/IPMI/GenericSerialBus write requires Buffer of length 66, found length 32 (20150930/exfield-418)
[31434463.721507] ACPI Error: Method parse/execution failed [\_SB.PMI0._PMM] (Node ffff883f7f89de28), AE_AML_BUFFER_LIMIT (20150930/psparse-542)
[31434463.721522] ACPI Exception: AE_AML_BUFFER_LIMIT, Evaluating _PMM (20150930/power_meter-338)
[31434513.619686] ACPI Error: SMBus/IPMI/GenericSerialBus write requires Buffer of length 66, found length 32 (20150930/exfield-418)
[31434513.619699] ACPI Error: Method parse/execution failed [\_SB.PMI0._PMM] (Node ffff883f7f89de28), AE_AML_BUFFER_LIMIT (20150930/psparse-542)
[31434513.619716] ACPI Exception: AE_AML_BUFFER_LIMIT, Evaluating _PMM (20150930/power_meter-338)
[31434523.726436] ACPI Error: SMBus/IPMI/GenericSerialBus write requires Buffer of length 66, found length 32 (20150930/exfield-418)
[31434523.726450] ACPI Error: Method parse/execution failed [\_SB.PMI0._PMM] (Node ffff883f7f89de28), AE_AML_BUFFER_LIMIT (20150930/psparse-542)
[31434523.726467] ACPI Exception: AE_AML_BUFFER_LIMIT, Evaluating _PMM (20150930/power_meter-338)
[31434573.622534] ACPI Error: SMBus/IPMI/GenericSerialBus write requires Buffer of length 66, found length 32 (20150930/exfield-418)
[31434573.622547] ACPI Error: Method parse/execution failed [\_SB.PMI0._PMM] (Node ffff883f7f89de28), AE_AML_BUFFER_LIMIT (20150930/psparse-542)
[31434573.622564] ACPI Exception: AE_AML_BUFFER_LIMIT, Evaluating _PMM (20150930/power_meter-338)
[31434583.726645] ACPI Error: SMBus/IPMI/GenericSerialBus write requires Buffer of length 66, found length 32 (20150930/exfield-418)
[31434583.726658] ACPI Error: Method parse/execution failed [\_SB.PMI0._PMM] (Node ffff883f7f89de28), AE_AML_BUFFER_LIMIT (20150930/psparse-542)
[31434583.726676] ACPI Exception: AE_AML_BUFFER_LIMIT, Evaluating _PMM (20150930/power_meter-338)
[31434633.624391] ACPI Error: SMBus/IPMI/GenericSerialBus write requires Buffer of length 66, found length 32 (20150930/exfield-418)
[31434633.624403] ACPI Error: Method parse/execution failed [\_SB.PMI0._PMM] (Node ffff883f7f89de28), AE_AML_BUFFER_LIMIT (20150930/psparse-542)
[31434633.624419] ACPI Exception: AE_AML_BUFFER_LIMIT, Evaluating _PMM (20150930/power_meter-338)
[31434643.728932] ACPI Error: SMBus/IPMI/GenericSerialBus write requires Buffer of length 66, found length 32 (20150930/exfield-418)
[31434643.728942] ACPI Error: Method parse/execution failed [\_SB.PMI0._PMM] (Node ffff883f7f89de28), AE_AML_BUFFER_LIMIT (20150930/psparse-542)
[31434643.728955] ACPI Exception: AE_AML_BUFFER_LIMIT, Evaluating _PMM (20150930/power_meter-338)
[31434693.630279] ACPI Error: SMBus/IPMI/GenericSerialBus write requires Buffer of length 66, found length 32 (20150930/exfield-418)
[31434693.630292] ACPI Error: Method parse/execution failed [\_SB.PMI0._PMM] (Node ffff883f7f89de28), AE_AML_BUFFER_LIMIT (20150930/psparse-542)
[31434693.630305] ACPI Exception: AE_AML_BUFFER_LIMIT, Evaluating _PMM (20150930/power_meter-338)
[31434703.731460] ACPI Error: SMBus/IPMI/GenericSerialBus write requires Buffer of length 66, found length 32 (20150930/exfield-418)
[31434703.731472] ACPI Error: Method parse/execution failed [\_SB.PMI0._PMM] (Node ffff883f7f89de28), AE_AML_BUFFER_LIMIT (20150930/psparse-542)
[31434703.731486] ACPI Exception: AE_AML_BUFFER_LIMIT, Evaluating _PMM (20150930/power_meter-338)
[31434753.631213] ACPI Error: SMBus/IPMI/GenericSerialBus write requires Buffer of length 66, found length 32 (20150930/exfield-418)
[31434753.631225] ACPI Error: Method parse/execution failed [\_SB.PMI0._PMM] (Node ffff883f7f89de28), AE_AML_BUFFER_LIMIT (20150930/psparse-542)
[31434753.631241] ACPI Exception: AE_AML_BUFFER_LIMIT, Evaluating _PMM (20150930/power_meter-338)
[31434763.734325] ACPI Error: SMBus/IPMI/GenericSerialBus write requires Buffer of length 66, found length 32 (20150930/exfield-418)
[31434763.734338] ACPI Error: Method parse/execution failed [\_SB.PMI0._PMM] (Node ffff883f7f89de28), AE_AML_BUFFER_LIMIT (20150930/psparse-542)
[31434763.734356] ACPI Exception: AE_AML_BUFFER_LIMIT, Evaluating _PMM (20150930/power_meter-338)
[31434813.633611] ACPI Error: SMBus/IPMI/GenericSerialBus write requires Buffer of length 66, found length 32 (20150930/exfield-418)
[31434813.633623] ACPI Error: Method parse/execution failed [\_SB.PMI0._PMM] (Node ffff883f7f89de28), AE_AML_BUFFER_LIMIT (20150930/psparse-542)
[31434813.633640] ACPI Exception: AE_AML_BUFFER_LIMIT, Evaluating _PMM (20150930/power_meter-338)
[31434823.737448] ACPI Error: SMBus/IPMI/GenericSerialBus write requires Buffer of length 66, found length 32 (20150930/exfield-418)
[31434823.737463] ACPI Error: Method parse/execution failed [\_SB.PMI0._PMM] (Node ffff883f7f89de28), AE_AML_BUFFER_LIMIT (20150930/psparse-542)
[31434823.737483] ACPI Exception: AE_AML_BUFFER_LIMIT, Evaluating _PMM (20150930/power_meter-338)
[31434873.637510] ACPI Error: SMBus/IPMI/GenericSerialBus write requires Buffer of length 66, found length 32 (20150930/exfield-418)
[31434873.637522] ACPI Error: Method parse/execution failed [\_SB.PMI0._PMM] (Node ffff883f7f89de28), AE_AML_BUFFER_LIMIT (20150930/psparse-542)
[31434873.637537] ACPI Exception: AE_AML_BUFFER_LIMIT, Evaluating _PMM (20150930/power_meter-338)
[31434883.740779] ACPI Error: SMBus/IPMI/GenericSerialBus write requires Buffer of length 66, found length 32 (20150930/exfield-418)
[31434883.740790] ACPI Error: Method parse/execution failed [\_SB.PMI0._PMM] (Node ffff883f7f89de28), AE_AML_BUFFER_LIMIT (20150930/psparse-542)
[31434883.740803] ACPI Exception: AE_AML_BUFFER_LIMIT, Evaluating _PMM (20150930/power_meter-338)
[31434933.637812] ACPI Error: SMBus/IPMI/GenericSerialBus write requires Buffer of length 66, found length 32 (20150930/exfield-418)
[31434933.637825] ACPI Error: Method parse/execution failed [\_SB.PMI0._PMM] (Node ffff883f7f89de28), AE_AML_BUFFER_LIMIT (20150930/psparse-542)
[31434933.638158] ACPI Exception: AE_AML_BUFFER_LIMIT, Evaluating _PMM (20150930/power_meter-338)
[31434943.740963] ACPI Error: SMBus/IPMI/GenericSerialBus write requires Buffer of length 66, found length 32 (20150930/exfield-418)
[31434943.740973] ACPI Error: Method parse/execution failed [\_SB.PMI0._PMM] (Node ffff883f7f89de28), AE_AML_BUFFER_LIMIT (20150930/psparse-542)
[31434943.740988] ACPI Exception: AE_AML_BUFFER_LIMIT, Evaluating _PMM (20150930/power_meter-338)
[31434993.640365] ACPI Error: SMBus/IPMI/GenericSerialBus write requires Buffer of length 66, found length 32 (20150930/exfield-418)
[31434993.640379] ACPI Error: Method parse/execution failed [\_SB.PMI0._PMM] (Node ffff883f7f89de28), AE_AML_BUFFER_LIMIT (20150930/psparse-542)
[31434993.640414] ACPI Exception: AE_AML_BUFFER_LIMIT, Evaluating _PMM (20150930/power_meter-338)
[31435003.744401] ACPI Error: SMBus/IPMI/GenericSerialBus write requires Buffer of length 66, found length 32 (20150930/exfield-418)
[31435003.744412] ACPI Error: Method parse/execution failed [\_SB.PMI0._PMM] (Node ffff883f7f89de28), AE_AML_BUFFER_LIMIT (20150930/psparse-542)
[31435003.744426] ACPI Exception: AE_AML_BUFFER_LIMIT, Evaluating _PMM (20150930/power_meter-338)
[31435053.643904] ACPI Error: SMBus/IPMI/GenericSerialBus write requires Buffer of length 66, found length 32 (20150930/exfield-418)
[31435053.643914] ACPI Error: Method parse/execution failed [\_SB.PMI0._PMM] (Node ffff883f7f89de28), AE_AML_BUFFER_LIMIT (20150930/psparse-542)
[31435053.643927] ACPI Exception: AE_AML_BUFFER_LIMIT, Evaluating _PMM (20150930/power_meter-338)
[31435063.748026] ACPI Error: SMBus/IPMI/GenericSerialBus write requires Buffer of length 66, found length 32 (20150930/exfield-418)
[31435063.748042] ACPI Error: Method parse/execution failed [\_SB.PMI0._PMM] (Node ffff883f7f89de28), AE_AML_BUFFER_LIMIT (20150930/psparse-542)
[31435063.748064] ACPI Exception: AE_AML_BUFFER_LIMIT, Evaluating _PMM (20150930/power_meter-338)
[31435113.647682] ACPI Error: SMBus/IPMI/GenericSerialBus write requires Buffer of length 66, found length 32 (20150930/exfield-418)
[31435113.647695] ACPI Error: Method parse/execution failed [\_SB.PMI0._PMM] (Node ffff883f7f89de28), AE_AML_BUFFER_LIMIT (20150930/psparse-542)
[31435113.647713] ACPI Exception: AE_AML_BUFFER_LIMIT, Evaluating _PMM (20150930/power_meter-338)
[31435123.749449] ACPI Error: SMBus/IPMI/GenericSerialBus write requires Buffer of length 66, found length 32 (20150930/exfield-418)
[31435123.749462] ACPI Error: Method parse/execution failed [\_SB.PMI0._PMM] (Node ffff883f7f89de28), AE_AML_BUFFER_LIMIT (20150930/psparse-542)
[31435123.749481] ACPI Exception: AE_AML_BUFFER_LIMIT, Evaluating _PMM (20150930/power_meter-338)
[31435173.647893] ACPI Error: SMBus/IPMI/GenericSerialBus write requires Buffer of length 66, found length 32 (20150930/exfield-418)
[31435173.647908] ACPI Error: Method parse/execution failed [\_SB.PMI0._PMM] (Node ffff883f7f89de28), AE_AML_BUFFER_LIMIT (20150930/psparse-542)
[31435173.647925] ACPI Exception: AE_AML_BUFFER_LIMIT, Evaluating _PMM (20150930/power_meter-338)
[31435183.752431] ACPI Error: SMBus/IPMI/GenericSerialBus write requires Buffer of length 66, found length 32 (20150930/exfield-418)
[31435183.752447] ACPI Error: Method parse/execution failed [\_SB.PMI0._PMM] (Node ffff883f7f89de28), AE_AML_BUFFER_LIMIT (20150930/psparse-542)
[31435183.752466] ACPI Exception: AE_AML_BUFFER_LIMIT, Evaluating _PMM (20150930/power_meter-338)
[31435233.650074] ACPI Error: SMBus/IPMI/GenericSerialBus write requires Buffer of length 66, found length 32 (20150930/exfield-418)
[31435233.650083] ACPI Error: Method parse/execution failed [\_SB.PMI0._PMM] (Node ffff883f7f89de28), AE_AML_BUFFER_LIMIT (20150930/psparse-542)
[31435233.650095] ACPI Exception: AE_AML_BUFFER_LIMIT, Evaluating _PMM (20150930/power_meter-338)
[31435243.755518] ACPI Error: SMBus/IPMI/GenericSerialBus write requires Buffer of length 66, found length 32 (20150930/exfield-418)
[31435243.755528] ACPI Error: Method parse/execution failed [\_SB.PMI0._PMM] (Node ffff883f7f89de28), AE_AML_BUFFER_LIMIT (20150930/psparse-542)
[31435243.755542] ACPI Exception: AE_AML_BUFFER_LIMIT, Evaluating _PMM (20150930/power_meter-338)
[31435293.655386] ACPI Error: SMBus/IPMI/GenericSerialBus write requires Buffer of length 66, found length 32 (20150930/exfield-418)
[31435293.655395] ACPI Error: Method parse/execution failed [\_SB.PMI0._PMM] (Node ffff883f7f89de28), AE_AML_BUFFER_LIMIT (20150930/psparse-542)
[31435293.655422] ACPI Exception: AE_AML_BUFFER_LIMIT, Evaluating _PMM (20150930/power_meter-338)
[31435303.758469] ACPI Error: SMBus/IPMI/GenericSerialBus write requires Buffer of length 66, found length 32 (20150930/exfield-418)
[31435303.758478] ACPI Error: Method parse/execution failed [\_SB.PMI0._PMM] (Node ffff883f7f89de28), AE_AML_BUFFER_LIMIT (20150930/psparse-542)
[31435303.758490] ACPI Exception: AE_AML_BUFFER_LIMIT, Evaluating _PMM (20150930/power_meter-338)
[31435353.660122] ACPI Error: SMBus/IPMI/GenericSerialBus write requires Buffer of length 66, found length 32 (20150930/exfield-418)
[31435353.660132] ACPI Error: Method parse/execution failed [\_SB.PMI0._PMM] (Node ffff883f7f89de28), AE_AML_BUFFER_LIMIT (20150930/psparse-542)
[31435353.660145] ACPI Exception: AE_AML_BUFFER_LIMIT, Evaluating _PMM (20150930/power_meter-338)
[31435363.758972] ACPI Error: SMBus/IPMI/GenericSerialBus write requires Buffer of length 66, found length 32 (20150930/exfield-418)
[31435363.758985] ACPI Error: Method parse/execution failed [\_SB.PMI0._PMM] (Node ffff883f7f89de28), AE_AML_BUFFER_LIMIT (20150930/psparse-542)
[31435363.759005] ACPI Exception: AE_AML_BUFFER_LIMIT, Evaluating _PMM (20150930/power_meter-338)
[31435413.659250] ACPI Error: SMBus/IPMI/GenericSerialBus write requires Buffer of length 66, found length 32 (20150930/exfield-418)
[31435413.659262] ACPI Error: Method parse/execution failed [\_SB.PMI0._PMM] (Node ffff883f7f89de28), AE_AML_BUFFER_LIMIT (20150930/psparse-542)
[31435413.659279] ACPI Exception: AE_AML_BUFFER_LIMIT, Evaluating _PMM (20150930/power_meter-338)
[31435423.764043] ACPI Error: SMBus/IPMI/GenericSerialBus write requires Buffer of length 66, found length 32 (20150930/exfield-418)
[31435423.764053] ACPI Error: Method parse/execution failed [\_SB.PMI0._PMM] (Node ffff883f7f89de28), AE_AML_BUFFER_LIMIT (20150930/psparse-542)
[31435423.764067] ACPI Exception: AE_AML_BUFFER_LIMIT, Evaluating _PMM (20150930/power_meter-338)
[31435473.659446] ACPI Error: SMBus/IPMI/GenericSerialBus write requires Buffer of length 66, found length 32 (20150930/exfield-418)
[31435473.659457] ACPI Error: Method parse/execution failed [\_SB.PMI0._PMM] (Node ffff883f7f89de28), AE_AML_BUFFER_LIMIT (20150930/psparse-542)
[31435473.659472] ACPI Exception: AE_AML_BUFFER_LIMIT, Evaluating _PMM (20150930/power_meter-338)
[31435483.766656] ACPI Error: SMBus/IPMI/GenericSerialBus write requires Buffer of length 66, found length 32 (20150930/exfield-418)
[31435483.766669] ACPI Error: Method parse/execution failed [\_SB.PMI0._PMM] (Node ffff883f7f89de28), AE_AML_BUFFER_LIMIT (20150930/psparse-542)
[31435483.766689] ACPI Exception: AE_AML_BUFFER_LIMIT, Evaluating _PMM (20150930/power_meter-338)
[31435533.663105] ACPI Error: SMBus/IPMI/GenericSerialBus write requires Buffer of length 66, found length 32 (20150930/exfield-418)
[31435533.663119] ACPI Error: Method parse/execution failed [\_SB.PMI0._PMM] (Node ffff883f7f89de28), AE_AML_BUFFER_LIMIT (20150930/psparse-542)
[31435533.663134] ACPI Exception: AE_AML_BUFFER_LIMIT, Evaluating _PMM (20150930/power_meter-338)
[31435543.770802] ACPI Error: SMBus/IPMI/GenericSerialBus write requires Buffer of length 66, found length 32 (20150930/exfield-418)
[31435543.770815] ACPI Error: Method parse/execution failed [\_SB.PMI0._PMM] (Node ffff883f7f89de28), AE_AML_BUFFER_LIMIT (20150930/psparse-542)
[31435543.770829] ACPI Exception: AE_AML_BUFFER_LIMIT, Evaluating _PMM (20150930/power_meter-338)
[31435593.666141] ACPI Error: SMBus/IPMI/GenericSerialBus write requires Buffer of length 66, found length 32 (20150930/exfield-418)
[31435593.666151] ACPI Error: Method parse/execution failed [\_SB.PMI0._PMM] (Node ffff883f7f89de28), AE_AML_BUFFER_LIMIT (20150930/psparse-542)
[31435593.666163] ACPI Exception: AE_AML_BUFFER_LIMIT, Evaluating _PMM (20150930/power_meter-338)
[31435603.770357] ACPI Error: SMBus/IPMI/GenericSerialBus write requires Buffer of length 66, found length 32 (20150930/exfield-418)
[31435603.770368] ACPI Error: Method parse/execution failed [\_SB.PMI0._PMM] (Node ffff883f7f89de28), AE_AML_BUFFER_LIMIT (20150930/psparse-542)
[31435603.770385] ACPI Exception: AE_AML_BUFFER_LIMIT, Evaluating _PMM (20150930/power_meter-338)
[31435653.670912] ACPI Error: SMBus/IPMI/GenericSerialBus write requires Buffer of length 66, found length 32 (20150930/exfield-418)
[31435653.670924] ACPI Error: Method parse/execution failed [\_SB.PMI0._PMM] (Node ffff883f7f89de28), AE_AML_BUFFER_LIMIT (20150930/psparse-542)
[31435653.670939] ACPI Exception: AE_AML_BUFFER_LIMIT, Evaluating _PMM (20150930/power_meter-338)
[31435663.772753] ACPI Error: SMBus/IPMI/GenericSerialBus write requires Buffer of length 66, found length 32 (20150930/exfield-418)
[31435663.772765] ACPI Error: Method parse/execution failed [\_SB.PMI0._PMM] (Node ffff883f7f89de28), AE_AML_BUFFER_LIMIT (20150930/psparse-542)
[31435663.772782] ACPI Exception: AE_AML_BUFFER_LIMIT, Evaluating _PMM (20150930/power_meter-338)
[31435713.669949] ACPI Error: SMBus/IPMI/GenericSerialBus write requires Buffer of length 66, found length 32 (20150930/exfield-418)
[31435713.669959] ACPI Error: Method parse/execution failed [\_SB.PMI0._PMM] (Node ffff883f7f89de28), AE_AML_BUFFER_LIMIT (20150930/psparse-542)
[31435713.669973] ACPI Exception: AE_AML_BUFFER_LIMIT, Evaluating _PMM (20150930/power_meter-338)
[31435723.776816] ACPI Error: SMBus/IPMI/GenericSerialBus write requires Buffer of length 66, found length 32 (20150930/exfield-418)
[31435723.776829] ACPI Error: Method parse/execution failed [\_SB.PMI0._PMM] (Node ffff883f7f89de28), AE_AML_BUFFER_LIMIT (20150930/psparse-542)
[31435723.776848] ACPI Exception: AE_AML_BUFFER_LIMIT, Evaluating _PMM (20150930/power_meter-338)
[31435773.673095] ACPI Error: SMBus/IPMI/GenericSerialBus write requires Buffer of length 66, found length 32 (20150930/exfield-418)
[31435773.673106] ACPI Error: Method parse/execution failed [\_SB.PMI0._PMM] (Node ffff883f7f89de28), AE_AML_BUFFER_LIMIT (20150930/psparse-542)
[31435773.673121] ACPI Exception: AE_AML_BUFFER_LIMIT, Evaluating _PMM (20150930/power_meter-338)
[31435783.779880] ACPI Error: SMBus/IPMI/GenericSerialBus write requires Buffer of length 66, found length 32 (20150930/exfield-418)
[31435783.779889] ACPI Error: Method parse/execution failed [\_SB.PMI0._PMM] (Node ffff883f7f89de28), AE_AML_BUFFER_LIMIT (20150930/psparse-542)
[31435783.779902] ACPI Exception: AE_AML_BUFFER_LIMIT, Evaluating _PMM (20150930/power_meter-338)
[31435833.675816] ACPI Error: SMBus/IPMI/GenericSerialBus write requires Buffer of length 66, found length 32 (20150930/exfield-418)
[31435833.675826] ACPI Error: Method parse/execution failed [\_SB.PMI0._PMM] (Node ffff883f7f89de28), AE_AML_BUFFER_LIMIT (20150930/psparse-542)
[31435833.675840] ACPI Exception: AE_AML_BUFFER_LIMIT, Evaluating _PMM (20150930/power_meter-338)
[31435843.782674] ACPI Error: SMBus/IPMI/GenericSerialBus write requires Buffer of length 66, found length 32 (20150930/exfield-418)
[31435843.782685] ACPI Error: Method parse/execution failed [\_SB.PMI0._PMM] (Node ffff883f7f89de28), AE_AML_BUFFER_LIMIT (20150930/psparse-542)
[31435843.782701] ACPI Exception: AE_AML_BUFFER_LIMIT, Evaluating _PMM (20150930/power_meter-338)
[31435893.679580] ACPI Error: SMBus/IPMI/GenericSerialBus write requires Buffer of length 66, found length 32 (20150930/exfield-418)
[31435893.679594] ACPI Error: Method parse/execution failed [\_SB.PMI0._PMM] (Node ffff883f7f89de28), AE_AML_BUFFER_LIMIT (20150930/psparse-542)
[31435893.679615] ACPI Exception: AE_AML_BUFFER_LIMIT, Evaluating _PMM (20150930/power_meter-338)
[31435903.783673] ACPI Error: SMBus/IPMI/GenericSerialBus write requires Buffer of length 66, found length 32 (20150930/exfield-418)
[31435903.783683] ACPI Error: Method parse/execution failed [\_SB.PMI0._PMM] (Node ffff883f7f89de28), AE_AML_BUFFER_LIMIT (20150930/psparse-542)
[31435903.783697] ACPI Exception: AE_AML_BUFFER_LIMIT, Evaluating _PMM (20150930/power_meter-338)
[31435953.684059] ACPI Error: SMBus/IPMI/GenericSerialBus write requires Buffer of length 66, found length 32 (20150930/exfield-418)
[31435953.684068] ACPI Error: Method parse/execution failed [\_SB.PMI0._PMM] (Node ffff883f7f89de28), AE_AML_BUFFER_LIMIT (20150930/psparse-542)
[31435953.684079] ACPI Exception: AE_AML_BUFFER_LIMIT, Evaluating _PMM (20150930/power_meter-338)
[31435963.785011] ACPI Error: SMBus/IPMI/GenericSerialBus write requires Buffer of length 66, found length 32 (20150930/exfield-418)
[31435963.785020] ACPI Error: Method parse/execution failed [\_SB.PMI0._PMM] (Node ffff883f7f89de28), AE_AML_BUFFER_LIMIT (20150930/psparse-542)
[31435963.785032] ACPI Exception: AE_AML_BUFFER_LIMIT, Evaluating _PMM (20150930/power_meter-338)
[31436013.684639] ACPI Error: SMBus/IPMI/GenericSerialBus write requires Buffer of length 66, found length 32 (20150930/exfield-418)
[31436013.684651] ACPI Error: Method parse/execution failed [\_SB.PMI0._PMM] (Node ffff883f7f89de28), AE_AML_BUFFER_LIMIT (20150930/psparse-542)
[31436013.684669] ACPI Exception: AE_AML_BUFFER_LIMIT, Evaluating _PMM (20150930/power_meter-338)
[31505843.019756] Process accounting resumed
[31586854.967056] TCP: request_sock_TCP: Possible SYN flooding on port 5666. Sending cookies.  Check SNMP counters.
[31586858.583792] hpsa 0000:08:00.0: scsi 0:1:0:0 Aborting command ffff884fbb297640Tag:0x00000000:00000240 CDBLen: 16 CDB: 0x8800... SN: 0x0  BEING SENT
[31586858.583802] hpsa 0000:08:00.0: scsi 0:1:0:0: Aborting command Direct-Access     HP       LOGICAL VOLUME   RAID-1(+0) SSDSmartPathCap+ En+ Exp=1
[31586994.017590] INFO: task jbd2/sda1-8:222 blocked for more than 120 seconds.
[31586994.049656]       Not tainted 4.4.0-1-amd64 #1
[31586994.070899] "echo 0 > /proc/sys/kernel/hung_task_timeout_secs" disables this message.
[31586994.107387] jbd2/sda1-8     D ffff883f7fcd5d80     0   222      2 0x00000000
[31586994.107391]  ffff887f63e16480 ffff883f66f381c0 ffff887f632f8000 ffff887f632f7b00
[31586994.107393]  7fffffffffffffff ffffffff81590a90 ffff887f632f7b80 0000000000001675
[31586994.107394]  ffffffff81590211 0000000000000000 ffffffff815931a5 7fffffffffffffff
[31586994.107396] Call Trace:
[31586994.107405]  [<ffffffff81590a90>] ? bit_wait_timeout+0xa0/0xa0
[31586994.107416]  [<ffffffff81590211>] ? schedule+0x31/0x80
[31586994.107427]  [<ffffffff815931a5>] ? schedule_timeout+0x235/0x2d0
[31586994.107433]  [<ffffffff812be0bb>] ? queue_unplugged+0x9b/0xa0
[31586994.107434]  [<ffffffff81590a90>] ? bit_wait_timeout+0xa0/0xa0
[31586994.107436]  [<ffffffff8158f814>] ? io_schedule_timeout+0xb4/0x130
[31586994.107440]  [<ffffffff810b8095>] ? prepare_to_wait+0x55/0x80
[31586994.107441]  [<ffffffff81590aa7>] ? bit_wait_io+0x17/0x60
[31586994.107446]  [<ffffffff8159058a>] ? __wait_on_bit+0x5a/0x90
[31586994.107458]  [<ffffffff81168bf1>] ? wait_on_page_bit+0xc1/0xe0
[31586994.107465]  [<ffffffff810b8400>] ? autoremove_wake_function+0x40/0x40
[31586994.107468]  [<ffffffff81168ce7>] ? __filemap_fdatawait_range+0xd7/0x150
[31586994.107470]  [<ffffffff812c253f>] ? submit_bio+0x6f/0x170
[31586994.107471]  [<ffffffff81168d6f>] ? filemap_fdatawait_range+0xf/0x30
[31586994.107480]  [<ffffffffa014fd45>] ? jbd2_journal_commit_transaction+0xd15/0x1900 [jbd2]
[31586994.107490]  [<ffffffff810ac91c>] ? dequeue_entity+0x3ec/0x910
[31586994.107499]  [<ffffffff810ad015>] ? put_prev_entity+0x35/0x710
[31586994.107502]  [<ffffffff810dd419>] ? try_to_del_timer_sync+0x59/0x80
[31586994.107505]  [<ffffffffa01541cd>] ? kjournald2+0xdd/0x280 [jbd2]
[31586994.107512]  [<ffffffff810b83c0>] ? wait_woken+0x90/0x90
[31586994.107517]  [<ffffffffa01540f0>] ? commit_timeout+0x10/0x10 [jbd2]
[31586994.107520]  [<ffffffff81096cff>] ? kthread+0xdf/0x100
[31586994.107526]  [<ffffffff81096c20>] ? kthread_park+0x50/0x50
[31586994.107529]  [<ffffffff8159435f>] ? ret_from_fork+0x3f/0x70
[31586994.107530]  [<ffffffff81096c20>] ? kthread_park+0x50/0x50
[31586994.107550] INFO: task xfsaild/dm-0:504 blocked for more than 120 seconds.
[31586994.139642]       Not tainted 4.4.0-1-amd64 #1
[31586994.160815] "echo 0 > /proc/sys/kernel/hung_task_timeout_secs" disables this message.
[31586994.198358] xfsaild/dm-0    D ffff88807fc15d80     0   504      2 0x00000000
[31586994.198360]  ffff887f63564200 ffff883f66f3af40 ffff887f6304c000 0000000000000000
[31586994.198362]  ffff887f63f52200 ffff887f6456d400 ffff887f6456d528 ffff883f64d04000
[31586994.198363]  ffffffff81590211 0000000000000001 ffffffffa070aef4 00001add0011a348
[31586994.198364] Call Trace:
[31586994.198366]  [<ffffffff81590211>] ? schedule+0x31/0x80
[31586994.198410]  [<ffffffffa070aef4>] ? _xfs_log_force+0x164/0x2d0 [xfs]
[31586994.198425]  [<ffffffff810a1f30>] ? wake_up_q+0x60/0x60
[31586994.198444]  [<ffffffffa070b081>] ? xfs_log_force+0x21/0x90 [xfs]
[31586994.198456]  [<ffffffffa0715b77>] ? xfsaild+0x197/0x740 [xfs]
[31586994.198472]  [<ffffffffa07159e0>] ? xfs_trans_ail_cursor_first+0x80/0x80 [xfs]
[31586994.198474]  [<ffffffff81096cff>] ? kthread+0xdf/0x100
[31586994.198475]  [<ffffffff81096c20>] ? kthread_park+0x50/0x50
[31586994.198477]  [<ffffffff8159435f>] ? ret_from_fork+0x3f/0x70
[31586994.198478]  [<ffffffff81096c20>] ? kthread_park+0x50/0x50
[31586994.198483] INFO: task rs:main Q:Reg:20615 blocked for more than 120 seconds.
[31586994.232078]       Not tainted 4.4.0-1-amd64 #1
[31586994.253882] "echo 0 > /proc/sys/kernel/hung_task_timeout_secs" disables this message.
[31586994.290500] rs:main Q:Reg   D ffff883f7fd95d80     0 20615      1 0x00000000
[31586994.290502]  ffff884515814040 ffff883f66f65000 ffff8859e8bb4000 ffff8859e8bb3a48
[31586994.290503]  7fffffffffffffff ffffffff81590a90 ffff8859e8bb3ac8 ffff887f6480d438
[31586994.290504]  ffffffff81590211 0000000000000000 ffffffff815931a5 7fffffffffffffff
[31586994.290505] Call Trace:
[31586994.290507]  [<ffffffff81590a90>] ? bit_wait_timeout+0xa0/0xa0
[31586994.290508]  [<ffffffff81590211>] ? schedule+0x31/0x80
[31586994.290509]  [<ffffffff815931a5>] ? schedule_timeout+0x235/0x2d0
[31586994.290510]  [<ffffffff81590a90>] ? bit_wait_timeout+0xa0/0xa0
[31586994.290512]  [<ffffffff8158f814>] ? io_schedule_timeout+0xb4/0x130
[31586994.290513]  [<ffffffff810b8095>] ? prepare_to_wait+0x55/0x80
[31586994.290514]  [<ffffffff81590aa7>] ? bit_wait_io+0x17/0x60
[31586994.290515]  [<ffffffff8159058a>] ? __wait_on_bit+0x5a/0x90
[31586994.290516]  [<ffffffff81590a90>] ? bit_wait_timeout+0xa0/0xa0
[31586994.290517]  [<ffffffff8159063e>] ? out_of_line_wait_on_bit+0x7e/0xa0
[31586994.290518]  [<ffffffff810b8400>] ? autoremove_wake_function+0x40/0x40
[31586994.290521]  [<ffffffffa014db4f>] ? do_get_write_access+0x24f/0x480 [jbd2]
[31586994.290539]  [<ffffffff8120f917>] ? __find_get_block+0xa7/0x110
[31586994.290546]  [<ffffffff812100c6>] ? __getblk_gfp+0x26/0x50
[31586994.290561]  [<ffffffffa03540b3>] ? ext4_dirty_inode+0x43/0x60 [ext4]
[31586994.290571]  [<ffffffffa014ddae>] ? jbd2_journal_get_write_access+0x2e/0x60 [jbd2]
[31586994.290584]  [<ffffffffa0380076>] ? __ext4_journal_get_write_access+0x36/0x70 [ext4]
[31586994.290597]  [<ffffffffa03506ed>] ? ext4_reserve_inode_write+0x5d/0x80 [ext4]
[31586994.290610]  [<ffffffffa035075f>] ? ext4_mark_inode_dirty+0x4f/0x210 [ext4]
[31586994.290615]  [<ffffffffa03540b3>] ? ext4_dirty_inode+0x43/0x60 [ext4]
[31586994.290619]  [<ffffffff8120734a>] ? __mark_inode_dirty+0x17a/0x370
[31586994.290621]  [<ffffffff811f4d79>] ? generic_update_time+0x79/0xd0
[31586994.290622]  [<ffffffff811f45ed>] ? file_update_time+0xbd/0x110
[31586994.290624]  [<ffffffff8116b379>] ? __generic_file_write_iter+0x99/0x1d0
[31586994.290629]  [<ffffffffa0347228>] ? ext4_file_write_iter+0x228/0x460 [ext4]
[31586994.290633]  [<ffffffff8147ee50>] ? sock_sendmsg+0x30/0x40
[31586994.290637]  [<ffffffff811da14d>] ? __vfs_write+0xcd/0x120
[31586994.290639]  [<ffffffff811da7a4>] ? vfs_write+0xa4/0x190
[31586994.290644]  [<ffffffff810f2683>] ? SyS_futex+0x83/0x180
[31586994.290645]  [<ffffffff811db522>] ? SyS_write+0x52/0xc0
[31586994.290646]  [<ffffffff81593fb6>] ? system_call_fast_compare_end+0xc/0x6b
[31586994.290654] INFO: task mysqld:14346 blocked for more than 120 seconds.
[31586994.321299]       Not tainted 4.4.0-1-amd64 #1
[31586994.342807] "echo 0 > /proc/sys/kernel/hung_task_timeout_secs" disables this message.
[31586994.379332] mysqld          D ffff88807fc55d80     0 14346  13821 0x00000000
[31586994.379335]  ffff887f65985240 ffff883f66f3a200 ffff88602ff04000 ffff88602ff03d00
[31586994.379337]  7fffffffffffffff ffffffff81590a90 ffff88602ff03d80 0007ffffffffffff
[31586994.379338]  ffffffff81590211 0000000000000000 ffffffff815931a5 7fffffffffffffff
[31586994.379339] Call Trace:
[31586994.379342]  [<ffffffff81590a90>] ? bit_wait_timeout+0xa0/0xa0
[31586994.379347]  [<ffffffff81590211>] ? schedule+0x31/0x80
[31586994.379348]  [<ffffffff815931a5>] ? schedule_timeout+0x235/0x2d0
[31586994.379350]  [<ffffffff812c3866>] ? blk_peek_request+0x46/0x260
[31586994.379363]  [<ffffffffa00162bd>] ? scsi_request_fn+0x3d/0x5f0 [scsi_mod]
[31586994.379364]  [<ffffffff81590a90>] ? bit_wait_timeout+0xa0/0xa0
[31586994.379365]  [<ffffffff8158f814>] ? io_schedule_timeout+0xb4/0x130
[31586994.379367]  [<ffffffff810b8095>] ? prepare_to_wait+0x55/0x80
[31586994.379368]  [<ffffffff81590aa7>] ? bit_wait_io+0x17/0x60
[31586994.379369]  [<ffffffff8159058a>] ? __wait_on_bit+0x5a/0x90
[31586994.379371]  [<ffffffff81168bf1>] ? wait_on_page_bit+0xc1/0xe0
[31586994.379372]  [<ffffffff810b8400>] ? autoremove_wake_function+0x40/0x40
[31586994.379374]  [<ffffffff81168ce7>] ? __filemap_fdatawait_range+0xd7/0x150
[31586994.379375]  [<ffffffff8116aa2f>] ? __filemap_fdatawrite_range+0xcf/0x100
[31586994.379377]  [<ffffffff81168d6f>] ? filemap_fdatawait_range+0xf/0x30
[31586994.379378]  [<ffffffff8116ab3b>] ? filemap_write_and_wait_range+0x3b/0x60
[31586994.379398]  [<ffffffffa06ee261>] ? xfs_file_fsync+0x61/0x220 [xfs]
[31586994.379400]  [<ffffffff8120c5d8>] ? do_fsync+0x38/0x60
[31586994.379400]  [<ffffffff8120c84c>] ? SyS_fsync+0xc/0x10
[31586994.379402]  [<ffffffff81593fb6>] ? system_call_fast_compare_end+0xc/0x6b
[31586994.379403] INFO: task mysqld:14348 blocked for more than 120 seconds.
[31586994.410203]       Not tainted 4.4.0-1-amd64 #1
[31586994.431575] "echo 0 > /proc/sys/kernel/hung_task_timeout_secs" disables this message.
[31586994.468287] mysqld          D ffff88807fc95d80     0 14348  13821 0x00000000
[31586994.468289]  ffff887f637540c0 ffff883f66f4ef80 ffff88602ff2c000 ffff88602ff2bb08
[31586994.468290]  7fffffffffffffff ffff887f637540c0 ffff887f637540c0 ffff884fbb18ed40
[31586994.468292]  ffffffff81590211 0000000000000000 ffffffff815931a5 7fffffffffffffff
[31586994.468293] Call Trace:
[31586994.468295]  [<ffffffff81590211>] ? schedule+0x31/0x80
[31586994.468296]  [<ffffffff815931a5>] ? schedule_timeout+0x235/0x2d0
[31586994.468303]  [<ffffffff812bddff>] ? __blk_run_queue+0x2f/0x40
[31586994.468310]  [<ffffffff812be045>] ? queue_unplugged+0x25/0xa0
[31586994.468316]  [<ffffffff8158f814>] ? io_schedule_timeout+0xb4/0x130
[31586994.468321]  [<ffffffff81217ba8>] ? do_blockdev_direct_IO+0x1b38/0x2bf0
[31586994.468334]  [<ffffffffa06e2fe0>] ? xfs_get_blocks+0x10/0x10 [xfs]
[31586994.468349]  [<ffffffffa06e24dc>] ? xfs_vm_direct_IO+0x6c/0xe0 [xfs]
[31586994.468358]  [<ffffffffa06e1820>] ? xfs_submit_ioend+0x120/0x120 [xfs]
[31586994.468371]  [<ffffffffa06ef0ee>] ? xfs_file_dio_aio_write+0x1ae/0x360 [xfs]
[31586994.468381]  [<ffffffffa06ef5b0>] ? xfs_file_write_iter+0xa0/0x170 [xfs]
[31586994.468385]  [<ffffffff811da14d>] ? __vfs_write+0xcd/0x120
[31586994.468386]  [<ffffffff811da7a4>] ? vfs_write+0xa4/0x190
[31586994.468388]  [<ffffffff811db6c6>] ? SyS_pwrite64+0x86/0xb0
[31586994.468389]  [<ffffffff81593fb6>] ? system_call_fast_compare_end+0xc/0x6b
[31586994.468393] INFO: task mysqld:14568 blocked for more than 120 seconds.
[31586994.499130]       Not tainted 4.4.0-1-amd64 #1
[31586994.521089] "echo 0 > /proc/sys/kernel/hung_task_timeout_secs" disables this message.
[31586994.559697] mysqld          D ffff883f7fc95d80     0 14568  13821 0x00000000
[31586994.559699]  ffff887f66bba180 ffff883f66f38f00 ffff887bf6d50000 ffff887bf6d4fab8
[31586994.559700]  7fffffffffffffff ffff887f66bba180 ffff887f66bba180 ffff881d2bfc15c0
[31586994.559702]  ffffffff81590211 0000000000000000 ffffffff815931a5 7fffffffffffffff
[31586994.559703] Call Trace:
[31586994.559705]  [<ffffffff81590211>] ? schedule+0x31/0x80
[31586994.559706]  [<ffffffff815931a5>] ? schedule_timeout+0x235/0x2d0
[31586994.559708]  [<ffffffff812bddff>] ? __blk_run_queue+0x2f/0x40
[31586994.559710]  [<ffffffff812be045>] ? queue_unplugged+0x25/0xa0
[31586994.559725]  [<ffffffff8158f814>] ? io_schedule_timeout+0xb4/0x130
[31586994.559735]  [<ffffffff81217ba8>] ? do_blockdev_direct_IO+0x1b38/0x2bf0
[31586994.559752]  [<ffffffffa06e2fe0>] ? xfs_get_blocks+0x10/0x10 [xfs]
[31586994.559761]  [<ffffffffa06e24dc>] ? xfs_vm_direct_IO+0x6c/0xe0 [xfs]
[31586994.559763]  [<ffffffff8116afa9>] ? generic_file_read_iter+0x449/0x600
[31586994.559773]  [<ffffffffa06ee001>] ? xfs_file_read_iter+0x111/0x310 [xfs]
[31586994.559781]  [<ffffffff811da04a>] ? __vfs_read+0xca/0x100
[31586994.559787]  [<ffffffff811da661>] ? vfs_read+0x81/0x120
[31586994.559789]  [<ffffffff811db616>] ? SyS_pread64+0x86/0xb0
[31586994.559791]  [<ffffffff81593fb6>] ? system_call_fast_compare_end+0xc/0x6b
[31586994.559803] INFO: task mysqld:32195 blocked for more than 120 seconds.
[31586994.591672]       Not tainted 4.4.0-1-amd64 #1
[31586994.612873] "echo 0 > /proc/sys/kernel/hung_task_timeout_secs" disables this message.
[31586994.649463] mysqld          D ffff88807fc95d80     0 32195  13821 0x00000000
[31586994.649465]  ffff881bb2898fc0 ffff883f66f4ef80 ffff88133e7e4000 ffff88133e7e3ab8
[31586994.649466]  7fffffffffffffff ffff881bb2898fc0 ffff881bb2898fc0 ffff884966c39a80
[31586994.649468]  ffffffff81590211 0000000000000000 ffffffff815931a5 7fffffffffffffff
[31586994.649469] Call Trace:
[31586994.649470]  [<ffffffff81590211>] ? schedule+0x31/0x80
[31586994.649472]  [<ffffffff815931a5>] ? schedule_timeout+0x235/0x2d0
[31586994.649480]  [<ffffffff812bddff>] ? __blk_run_queue+0x2f/0x40
[31586994.649486]  [<ffffffff812be045>] ? queue_unplugged+0x25/0xa0
[31586994.649492]  [<ffffffff8158f814>] ? io_schedule_timeout+0xb4/0x130
[31586994.649501]  [<ffffffff81217ba8>] ? do_blockdev_direct_IO+0x1b38/0x2bf0
[31586994.649524]  [<ffffffffa06e2fe0>] ? xfs_get_blocks+0x10/0x10 [xfs]
[31586994.649720]  [<ffffffffa06e24dc>] ? xfs_vm_direct_IO+0x6c/0xe0 [xfs]
[31586994.649722]  [<ffffffff8116afa9>] ? generic_file_read_iter+0x449/0x600
[31586994.649723]  [<ffffffff810a1b73>] ? try_to_wake_up+0x43/0x380
[31586994.649734]  [<ffffffffa06ee001>] ? xfs_file_read_iter+0x111/0x310 [xfs]
[31586994.649736]  [<ffffffff811da04a>] ? __vfs_read+0xca/0x100
[31586994.649737]  [<ffffffff811da661>] ? vfs_read+0x81/0x120
[31586994.649738]  [<ffffffff811db616>] ? SyS_pread64+0x86/0xb0
[31586994.649740]  [<ffffffff81593fb6>] ? system_call_fast_compare_end+0xc/0x6b
[31586994.649901] INFO: task mysqld:2580 blocked for more than 120 seconds.
[31586994.679813]       Not tainted 4.4.0-1-amd64 #1
[31586994.700980] "echo 0 > /proc/sys/kernel/hung_task_timeout_secs" disables this message.
[31586994.737696] mysqld          D ffff883f7fc95d80     0  2580  13821 0x00000000
[31586994.737698]  ffff8819b81d6400 ffff883f66f38f00 ffff88146e5e8000 ffff88146e5e7ab8
[31586994.737699]  7fffffffffffffff ffff8819b81d6400 ffff8819b81d6400 ffff881cd038a040
[31586994.737701]  ffffffff81590211 0000000000000000 ffffffff815931a5 7fffffffffffffff
[31586994.737702] Call Trace:
[31586994.737703]  [<ffffffff81590211>] ? schedule+0x31/0x80
[31586994.737705]  [<ffffffff815931a5>] ? schedule_timeout+0x235/0x2d0
[31586994.737706]  [<ffffffff812bddff>] ? __blk_run_queue+0x2f/0x40
[31586994.737707]  [<ffffffff812be045>] ? queue_unplugged+0x25/0xa0
[31586994.737708]  [<ffffffff8158f814>] ? io_schedule_timeout+0xb4/0x130
[31586994.737710]  [<ffffffff81217ba8>] ? do_blockdev_direct_IO+0x1b38/0x2bf0
[31586994.737722]  [<ffffffffa06e2fe0>] ? xfs_get_blocks+0x10/0x10 [xfs]
[31586994.737732]  [<ffffffffa06e24dc>] ? xfs_vm_direct_IO+0x6c/0xe0 [xfs]
[31586994.737733]  [<ffffffff8116afa9>] ? generic_file_read_iter+0x449/0x600
[31586994.737744]  [<ffffffffa06ee001>] ? xfs_file_read_iter+0x111/0x310 [xfs]
[31586994.737745]  [<ffffffff811da04a>] ? __vfs_read+0xca/0x100
[31586994.737747]  [<ffffffff811da661>] ? vfs_read+0x81/0x120
[31586994.737748]  [<ffffffff811db616>] ? SyS_pread64+0x86/0xb0
[31586994.737750]  [<ffffffff81221994>] ? SyS_epoll_wait+0x94/0xd0
[31586994.737751]  [<ffffffff81593fb6>] ? system_call_fast_compare_end+0xc/0x6b
[31586994.737757] INFO: task mysqld:3818 blocked for more than 120 seconds.
[31586994.768051]       Not tainted 4.4.0-1-amd64 #1
[31586994.789479] "echo 0 > /proc/sys/kernel/hung_task_timeout_secs" disables this message.
[31586994.826133] mysqld          D ffff88807fdd5d80     0  3818  13821 0x00000000
[31586994.826134]  ffff887f6599afc0 ffff883f66f72340 ffff885b1895c000 ffff885b1895bab8
[31586994.826136]  7fffffffffffffff ffff887f6599afc0 ffff887f6599afc0 ffff885b9099fd00
[31586994.826137]  ffffffff81590211 0000000000000000 ffffffff815931a5 7fffffffffffffff
[31586994.826138] Call Trace:
[31586994.826140]  [<ffffffff81590211>] ? schedule+0x31/0x80
[31586994.826141]  [<ffffffff815931a5>] ? schedule_timeout+0x235/0x2d0
[31586994.826143]  [<ffffffff812bddff>] ? __blk_run_queue+0x2f/0x40
[31586994.826144]  [<ffffffff812be045>] ? queue_unplugged+0x25/0xa0
[31586994.826145]  [<ffffffff8158f814>] ? io_schedule_timeout+0xb4/0x130
[31586994.826147]  [<ffffffff81217ba8>] ? do_blockdev_direct_IO+0x1b38/0x2bf0
[31586994.826159]  [<ffffffffa06e2fe0>] ? xfs_get_blocks+0x10/0x10 [xfs]
[31586994.826185]  [<ffffffffa06e24dc>] ? xfs_vm_direct_IO+0x6c/0xe0 [xfs]
[31586994.826191]  [<ffffffff8116afa9>] ? generic_file_read_iter+0x449/0x600
[31586994.826198]  [<ffffffff810a1b73>] ? try_to_wake_up+0x43/0x380
[31586994.826214]  [<ffffffffa06ee001>] ? xfs_file_read_iter+0x111/0x310 [xfs]
[31586994.826216]  [<ffffffff811da04a>] ? __vfs_read+0xca/0x100
[31586994.826218]  [<ffffffff811da661>] ? vfs_read+0x81/0x120
[31586994.826219]  [<ffffffff811db616>] ? SyS_pread64+0x86/0xb0
[31586994.826220]  [<ffffffff81593fb6>] ? system_call_fast_compare_end+0xc/0x6b
[31586994.826226] INFO: task mysqld:4722 blocked for more than 120 seconds.
[31586994.856419]       Not tainted 4.4.0-1-amd64 #1
[31586994.877920] "echo 0 > /proc/sys/kernel/hung_task_timeout_secs" disables this message.
[31586994.914618] mysqld          D 0000000000000002     0  4722  13821 0x00000000
[31586994.914628]  ffff8817fe5a10c0 ffff881ad59c04c0 ffff8816b2d4c000 ffff8816b2d4bab8
[31586994.914630]  7fffffffffffffff ffff8817fe5a10c0 ffff8817fe5a10c0 ffff8815fa83d2c0
[31586994.914631]  ffffffff81590211 0000000000000000 ffffffff815931a5 7fffffffffffffff
[31586994.914632] Call Trace:
[31586994.914633]  [<ffffffff81590211>] ? schedule+0x31/0x80
[31586994.914634]  [<ffffffff815931a5>] ? schedule_timeout+0x235/0x2d0
[31586994.914636]  [<ffffffff812bddff>] ? __blk_run_queue+0x2f/0x40
[31586994.914637]  [<ffffffff812be045>] ? queue_unplugged+0x25/0xa0
[31586994.914641]  [<ffffffff8158f814>] ? io_schedule_timeout+0xb4/0x130
[31586994.914647]  [<ffffffff81217ba8>] ? do_blockdev_direct_IO+0x1b38/0x2bf0
[31586994.914663]  [<ffffffffa06e2fe0>] ? xfs_get_blocks+0x10/0x10 [xfs]
[31586994.914673]  [<ffffffffa06e24dc>] ? xfs_vm_direct_IO+0x6c/0xe0 [xfs]
[31586994.914677]  [<ffffffff8116afa9>] ? generic_file_read_iter+0x449/0x600
[31586994.914678]  [<ffffffff810a1b73>] ? try_to_wake_up+0x43/0x380
[31586994.914689]  [<ffffffffa06ee001>] ? xfs_file_read_iter+0x111/0x310 [xfs]
[31586994.914691]  [<ffffffff811da04a>] ? __vfs_read+0xca/0x100
[31586994.914692]  [<ffffffff811da661>] ? vfs_read+0x81/0x120
[31586994.914693]  [<ffffffff811db616>] ? SyS_pread64+0x86/0xb0
[31586994.914694]  [<ffffffff81593fb6>] ? system_call_fast_compare_end+0xc/0x6b
[31587155.972461] hpsa 0000:08:00.0: Controller lockup detected: 0x00130001 after 30
[31587155.972532] hpsa 0000:08:00.0: hpsa_send_abort_ioaccel2: Tag:0x00000000:00000240: unknown abort service response 0x00
[31587155.972537] hpsa 0000:08:00.0: scsi 0:1:0:0 Aborting command ffff884fbb297640Tag:0x00000000:00000240 CDBLen: 16 CDB: 0x8800... SN: 0x0  SENT, FAILED
[31587155.972541] hpsa 0000:08:00.0: scsi 0:1:0:0: FAILED to abort command Direct-Access     HP       LOGICAL VOLUME   RAID-1(+0) SSDSmartPathCap+ En+ Exp=1
[31587155.972548] hpsa 0000:08:00.0: scsi 0:1:0:0: ABORT FAILED, lockup detected Direct-Access     HP       LOGICAL VOLUME   RAID-1(+0) SSDSmartPathCap+ En+ Exp=1
[31587155.972551] hpsa 0000:08:00.0: scsi 0:1:0:0: ABORT FAILED, lockup detected Direct-Access     HP       LOGICAL VOLUME   RAID-1(+0) SSDSmartPathCap+ En+ Exp=1
[31587155.972553] hpsa 0000:08:00.0: scsi 0:1:0:0: ABORT FAILED, lockup detected Direct-Access     HP       LOGICAL VOLUME   RAID-1(+0) SSDSmartPathCap+ En+ Exp=1
[31587155.972556] hpsa 0000:08:00.0: scsi 0:1:0:0: ABORT FAILED, lockup detected Direct-Access     HP       LOGICAL VOLUME   RAID-1(+0) SSDSmartPathCap+ En+ Exp=1
[31587155.972558] hpsa 0000:08:00.0: scsi 0:1:0:0: ABORT FAILED, lockup detected Direct-Access     HP       LOGICAL VOLUME   RAID-1(+0) SSDSmartPathCap+ En+ Exp=1
[31587155.972559] hpsa 0000:08:00.0: scsi 0:1:0:0: ABORT FAILED, lockup detected Direct-Access     HP       LOGICAL VOLUME   RAID-1(+0) SSDSmartPathCap+ En+ Exp=1
[31587155.972562] hpsa 0000:08:00.0: scsi 0:1:0:0: ABORT FAILED, lockup detected Direct-Access     HP       LOGICAL VOLUME   RAID-1(+0) SSDSmartPathCap+ En+ Exp=1
[31587155.972564] hpsa 0000:08:00.0: scsi 0:1:0:0: ABORT FAILED, lockup detected Direct-Access     HP       LOGICAL VOLUME   RAID-1(+0) SSDSmartPathCap+ En+ Exp=1
[31587155.972566] hpsa 0000:08:00.0: scsi 0:1:0:0: ABORT FAILED, lockup detected Direct-Access     HP       LOGICAL VOLUME   RAID-1(+0) SSDSmartPathCap+ En+ Exp=1
[31587155.972568] hpsa 0000:08:00.0: scsi 0:1:0:0: ABORT FAILED, lockup detected Direct-Access     HP       LOGICAL VOLUME   RAID-1(+0) SSDSmartPathCap+ En+ Exp=1
[31587155.972569] hpsa 0000:08:00.0: scsi 0:1:0:0: ABORT FAILED, lockup detected Direct-Access     HP       LOGICAL VOLUME   RAID-1(+0) SSDSmartPathCap+ En+ Exp=1
[31587155.972571] hpsa 0000:08:00.0: scsi 0:1:0:0: ABORT FAILED, lockup detected Direct-Access     HP       LOGICAL VOLUME   RAID-1(+0) SSDSmartPathCap+ En+ Exp=1
[31587155.972573] hpsa 0000:08:00.0: scsi 0:1:0:0: ABORT FAILED, lockup detected Direct-Access     HP       LOGICAL VOLUME   RAID-1(+0) SSDSmartPathCap+ En+ Exp=1
[31587155.972575] hpsa 0000:08:00.0: scsi 0:1:0:0: ABORT FAILED, lockup detected Direct-Access     HP       LOGICAL VOLUME   RAID-1(+0) SSDSmartPathCap+ En+ Exp=1
[31587155.972577] hpsa 0000:08:00.0: scsi 0:1:0:0: ABORT FAILED, lockup detected Direct-Access     HP       LOGICAL VOLUME   RAID-1(+0) SSDSmartPathCap+ En+ Exp=1
[31587155.972579] hpsa 0000:08:00.0: scsi 0:1:0:0: ABORT FAILED, lockup detected Direct-Access     HP       LOGICAL VOLUME   RAID-1(+0) SSDSmartPathCap+ En+ Exp=1
[31587155.972581] hpsa 0000:08:00.0: scsi 0:1:0:0: ABORT FAILED, lockup detected Direct-Access     HP       LOGICAL VOLUME   RAID-1(+0) SSDSmartPathCap+ En+ Exp=1
[31587155.972583] hpsa 0000:08:00.0: scsi 0:1:0:0: ABORT FAILED, lockup detected Direct-Access     HP       LOGICAL VOLUME   RAID-1(+0) SSDSmartPathCap+ En+ Exp=1
[31587155.972585] hpsa 0000:08:00.0: scsi 0:1:0:0: ABORT FAILED, lockup detected Direct-Access     HP       LOGICAL VOLUME   RAID-1(+0) SSDSmartPathCap+ En+ Exp=1
[31587155.972587] hpsa 0000:08:00.0: scsi 0:1:0:0: ABORT FAILED, lockup detected Direct-Access     HP       LOGICAL VOLUME   RAID-1(+0) SSDSmartPathCap+ En+ Exp=1
[31587155.972589] hpsa 0000:08:00.0: scsi 0:1:0:0: ABORT FAILED, lockup detected Direct-Access     HP       LOGICAL VOLUME   RAID-1(+0) SSDSmartPathCap+ En+ Exp=1
[31587155.972590] hpsa 0000:08:00.0: scsi 0:1:0:0: ABORT FAILED, lockup detected Direct-Access     HP       LOGICAL VOLUME   RAID-1(+0) SSDSmartPathCap+ En+ Exp=1
[31587155.972592] hpsa 0000:08:00.0: scsi 0:1:0:0: ABORT FAILED, lockup detected Direct-Access     HP       LOGICAL VOLUME   RAID-1(+0) SSDSmartPathCap+ En+ Exp=1
[31587155.972594] hpsa 0000:08:00.0: scsi 0:1:0:0: ABORT FAILED, lockup detected Direct-Access     HP       LOGICAL VOLUME   RAID-1(+0) SSDSmartPathCap+ En+ Exp=1
[31587155.972596] hpsa 0000:08:00.0: scsi 0:1:0:0: ABORT FAILED, lockup detected Direct-Access     HP       LOGICAL VOLUME   RAID-1(+0) SSDSmartPathCap+ En+ Exp=1
[31587155.972597] hpsa 0000:08:00.0: scsi 0:1:0:0: ABORT FAILED, lockup detected Direct-Access     HP       LOGICAL VOLUME   RAID-1(+0) SSDSmartPathCap+ En+ Exp=1
[31587155.972599] hpsa 0000:08:00.0: scsi 0:1:0:0: ABORT FAILED, lockup detected Direct-Access     HP       LOGICAL VOLUME   RAID-1(+0) SSDSmartPathCap+ En+ Exp=1
[31587155.972601] hpsa 0000:08:00.0: scsi 0:1:0:0: ABORT FAILED, lockup detected Direct-Access     HP       LOGICAL VOLUME   RAID-1(+0) SSDSmartPathCap+ En+ Exp=1
[31587155.972603] hpsa 0000:08:00.0: scsi 0:1:0:0: ABORT FAILED, lockup detected Direct-Access     HP       LOGICAL VOLUME   RAID-1(+0) SSDSmartPathCap+ En+ Exp=1
[31587155.972605] hpsa 0000:08:00.0: scsi 0:1:0:0: ABORT FAILED, lockup detected Direct-Access     HP       LOGICAL VOLUME   RAID-1(+0) SSDSmartPathCap+ En+ Exp=1
[31587155.972607] hpsa 0000:08:00.0: scsi 0:1:0:0: ABORT FAILED, lockup detected Direct-Access     HP       LOGICAL VOLUME   RAID-1(+0) SSDSmartPathCap+ En+ Exp=1
[31587155.972609] hpsa 0000:08:00.0: scsi 0:1:0:0: ABORT FAILED, lockup detected Direct-Access     HP       LOGICAL VOLUME   RAID-1(+0) SSDSmartPathCap+ En+ Exp=1
[31587155.972611] hpsa 0000:08:00.0: scsi 0:1:0:0: ABORT FAILED, lockup detected Direct-Access     HP       LOGICAL VOLUME   RAID-1(+0) SSDSmartPathCap+ En+ Exp=1
[31587155.972613] hpsa 0000:08:00.0: scsi 0:1:0:0: ABORT FAILED, lockup detected Direct-Access     HP       LOGICAL VOLUME   RAID-1(+0) SSDSmartPathCap+ En+ Exp=1
[31587155.972615] hpsa 0000:08:00.0: scsi 0:1:0:0: ABORT FAILED, lockup detected Direct-Access     HP       LOGICAL VOLUME   RAID-1(+0) SSDSmartPathCap+ En+ Exp=1
[31587155.972617] hpsa 0000:08:00.0: scsi 0:1:0:0: ABORT FAILED, lockup detected Direct-Access     HP       LOGICAL VOLUME   RAID-1(+0) SSDSmartPathCap+ En+ Exp=1
[31587155.972619] hpsa 0000:08:00.0: scsi 0:1:0:0: ABORT FAILED, lockup detected Direct-Access     HP       LOGICAL VOLUME   RAID-1(+0) SSDSmartPathCap+ En+ Exp=1
[31587155.972621] hpsa 0000:08:00.0: scsi 0:1:0:0: ABORT FAILED, lockup detected Direct-Access     HP       LOGICAL VOLUME   RAID-1(+0) SSDSmartPathCap+ En+ Exp=1
[31587155.972623] hpsa 0000:08:00.0: scsi 0:1:0:0: ABORT FAILED, lockup detected Direct-Access     HP       LOGICAL VOLUME   RAID-1(+0) SSDSmartPathCap+ En+ Exp=1
[31587155.972626] hpsa 0000:08:00.0: scsi 0:1:0:0: ABORT FAILED, lockup detected Direct-Access     HP       LOGICAL VOLUME   RAID-1(+0) SSDSmartPathCap+ En+ Exp=1
[31587155.972628] hpsa 0000:08:00.0: scsi 0:1:0:0: ABORT FAILED, lockup detected Direct-Access     HP       LOGICAL VOLUME   RAID-1(+0) SSDSmartPathCap+ En+ Exp=1
[31587155.972629] hpsa 0000:08:00.0: scsi 0:1:0:0: ABORT FAILED, lockup detected Direct-Access     HP       LOGICAL VOLUME   RAID-1(+0) SSDSmartPathCap+ En+ Exp=1
[31587155.972631] hpsa 0000:08:00.0: scsi 0:1:0:0: ABORT FAILED, lockup detected Direct-Access     HP       LOGICAL VOLUME   RAID-1(+0) SSDSmartPathCap+ En+ Exp=1
[31587155.972633] hpsa 0000:08:00.0: scsi 0:1:0:0: ABORT FAILED, lockup detected Direct-Access     HP       LOGICAL VOLUME   RAID-1(+0) SSDSmartPathCap+ En+ Exp=1
[31587155.972635] hpsa 0000:08:00.0: scsi 0:1:0:0: ABORT FAILED, lockup detected Direct-Access     HP       LOGICAL VOLUME   RAID-1(+0) SSDSmartPathCap+ En+ Exp=1
[31587155.972637] hpsa 0000:08:00.0: scsi 0:1:0:0: ABORT FAILED, lockup detected Direct-Access     HP       LOGICAL VOLUME   RAID-1(+0) SSDSmartPathCap+ En+ Exp=1
[31587155.972639] hpsa 0000:08:00.0: scsi 0:1:0:0: ABORT FAILED, lockup detected Direct-Access     HP       LOGICAL VOLUME   RAID-1(+0) SSDSmartPathCap+ En+ Exp=1
[31587155.972640] hpsa 0000:08:00.0: scsi 0:1:0:0: ABORT FAILED, lockup detected Direct-Access     HP       LOGICAL VOLUME   RAID-1(+0) SSDSmartPathCap+ En+ Exp=1
[31587155.972642] hpsa 0000:08:00.0: scsi 0:1:0:0: ABORT FAILED, lockup detected Direct-Access     HP       LOGICAL VOLUME   RAID-1(+0) SSDSmartPathCap+ En+ Exp=1
[31587155.972644] hpsa 0000:08:00.0: scsi 0:1:0:0: ABORT FAILED, lockup detected Direct-Access     HP       LOGICAL VOLUME   RAID-1(+0) SSDSmartPathCap+ En+ Exp=1
[31587155.972646] hpsa 0000:08:00.0: scsi 0:1:0:0: ABORT FAILED, lockup detected Direct-Access     HP       LOGICAL VOLUME   RAID-1(+0) SSDSmartPathCap+ En+ Exp=1
[31587155.972648] hpsa 0000:08:00.0: scsi 0:1:0:0: ABORT FAILED, lockup detected Direct-Access     HP       LOGICAL VOLUME   RAID-1(+0) SSDSmartPathCap+ En+ Exp=1
[31587155.972650] hpsa 0000:08:00.0: scsi 0:1:0:0: ABORT FAILED, lockup detected Direct-Access     HP       LOGICAL VOLUME   RAID-1(+0) SSDSmartPathCap+ En+ Exp=1
[31587155.972652] hpsa 0000:08:00.0: scsi 0:1:0:0: ABORT FAILED, lockup detected Direct-Access     HP       LOGICAL VOLUME   RAID-1(+0) SSDSmartPathCap+ En+ Exp=1
[31587155.972654] hpsa 0000:08:00.0: scsi 0:1:0:0: ABORT FAILED, lockup detected Direct-Access     HP       LOGICAL VOLUME   RAID-1(+0) SSDSmartPathCap+ En+ Exp=1
[31587155.972656] hpsa 0000:08:00.0: scsi 0:1:0:0: ABORT FAILED, lockup detected Direct-Access     HP       LOGICAL VOLUME   RAID-1(+0) SSDSmartPathCap+ En+ Exp=1
[31587155.972658] hpsa 0000:08:00.0: scsi 0:1:0:0: ABORT FAILED, lockup detected Direct-Access     HP       LOGICAL VOLUME   RAID-1(+0) SSDSmartPathCap+ En+ Exp=1
[31587155.972660] hpsa 0000:08:00.0: scsi 0:1:0:0: ABORT FAILED, lockup detected Direct-Access     HP       LOGICAL VOLUME   RAID-1(+0) SSDSmartPathCap+ En+ Exp=1
[31587155.972662] hpsa 0000:08:00.0: scsi 0:1:0:0: ABORT FAILED, lockup detected Direct-Access     HP       LOGICAL VOLUME   RAID-1(+0) SSDSmartPathCap+ En+ Exp=1
[31587155.972672] hpsa 0000:08:00.0: scsi 0:1:0:0: ABORT FAILED, lockup detected Direct-Access     HP       LOGICAL VOLUME   RAID-1(+0) SSDSmartPathCap+ En+ Exp=1
[31587155.972674] hpsa 0000:08:00.0: scsi 0:1:0:0: ABORT FAILED, lockup detected Direct-Access     HP       LOGICAL VOLUME   RAID-1(+0) SSDSmartPathCap+ En+ Exp=1
[31587155.972676] hpsa 0000:08:00.0: scsi 0:1:0:0: ABORT FAILED, lockup detected Direct-Access     HP       LOGICAL VOLUME   RAID-1(+0) SSDSmartPathCap+ En+ Exp=1
[31587155.972677] hpsa 0000:08:00.0: scsi 0:1:0:0: ABORT FAILED, lockup detected Direct-Access     HP       LOGICAL VOLUME   RAID-1(+0) SSDSmartPathCap+ En+ Exp=1
[31587155.972679] hpsa 0000:08:00.0: scsi 0:1:0:0: ABORT FAILED, lockup detected Direct-Access     HP       LOGICAL VOLUME   RAID-1(+0) SSDSmartPathCap+ En+ Exp=1
[31587155.972681] hpsa 0000:08:00.0: scsi 0:1:0:0: ABORT FAILED, lockup detected Direct-Access     HP       LOGICAL VOLUME   RAID-1(+0) SSDSmartPathCap+ En+ Exp=1
[31587155.972682] hpsa 0000:08:00.0: scsi 0:1:0:0: ABORT FAILED, lockup detected Direct-Access     HP       LOGICAL VOLUME   RAID-1(+0) SSDSmartPathCap+ En+ Exp=1
[31587155.972684] hpsa 0000:08:00.0: scsi 0:1:0:0: ABORT FAILED, lockup detected Direct-Access     HP       LOGICAL VOLUME   RAID-1(+0) SSDSmartPathCap+ En+ Exp=1
[31587155.972686] hpsa 0000:08:00.0: scsi 0:1:0:0: ABORT FAILED, lockup detected Direct-Access     HP       LOGICAL VOLUME   RAID-1(+0) SSDSmartPathCap+ En+ Exp=1
[31587155.972688] hpsa 0000:08:00.0: scsi 0:1:0:0: ABORT FAILED, lockup detected Direct-Access     HP       LOGICAL VOLUME   RAID-1(+0) SSDSmartPathCap+ En+ Exp=1
[31587155.972690] hpsa 0000:08:00.0: scsi 0:1:0:0: ABORT FAILED, lockup detected Direct-Access     HP       LOGICAL VOLUME   RAID-1(+0) SSDSmartPathCap+ En+ Exp=1
[31587155.972691] hpsa 0000:08:00.0: scsi 0:1:0:0: ABORT FAILED, lockup detected Direct-Access     HP       LOGICAL VOLUME   RAID-1(+0) SSDSmartPathCap+ En+ Exp=1
[31587155.972693] hpsa 0000:08:00.0: scsi 0:1:0:0: ABORT FAILED, lockup detected Direct-Access     HP       LOGICAL VOLUME   RAID-1(+0) SSDSmartPathCap+ En+ Exp=1
[31587155.972695] hpsa 0000:08:00.0: scsi 0:1:0:0: ABORT FAILED, lockup detected Direct-Access     HP       LOGICAL VOLUME   RAID-1(+0) SSDSmartPathCap+ En+ Exp=1
[31587155.972696] hpsa 0000:08:00.0: scsi 0:1:0:0: ABORT FAILED, lockup detected Direct-Access     HP       LOGICAL VOLUME   RAID-1(+0) SSDSmartPathCap+ En+ Exp=1
[31587155.972698] hpsa 0000:08:00.0: scsi 0:1:0:0: ABORT FAILED, lockup detected Direct-Access     HP       LOGICAL VOLUME   RAID-1(+0) SSDSmartPathCap+ En+ Exp=1
[31587155.972700] hpsa 0000:08:00.0: scsi 0:1:0:0: ABORT FAILED, lockup detected Direct-Access     HP       LOGICAL VOLUME   RAID-1(+0) SSDSmartPathCap+ En+ Exp=1
[31587155.972702] hpsa 0000:08:00.0: scsi 0:1:0:0: ABORT FAILED, lockup detected Direct-Access     HP       LOGICAL VOLUME   RAID-1(+0) SSDSmartPathCap+ En+ Exp=1
[31587155.972705] hpsa 0000:08:00.0: scsi 0:1:0:0: ABORT FAILED, lockup detected Direct-Access     HP       LOGICAL VOLUME   RAID-1(+0) SSDSmartPathCap+ En+ Exp=1
[31587155.972707] hpsa 0000:08:00.0: scsi 0:1:0:0: ABORT FAILED, lockup detected Direct-Access     HP       LOGICAL VOLUME   RAID-1(+0) SSDSmartPathCap+ En+ Exp=1
[31587155.972709] hpsa 0000:08:00.0: scsi 0:1:0:0: ABORT FAILED, lockup detected Direct-Access     HP       LOGICAL VOLUME   RAID-1(+0) SSDSmartPathCap+ En+ Exp=1
[31587155.972711] hpsa 0000:08:00.0: scsi 0:1:0:0: ABORT FAILED, lockup detected Direct-Access     HP       LOGICAL VOLUME   RAID-1(+0) SSDSmartPathCap+ En+ Exp=1
[31587155.972713] hpsa 0000:08:00.0: scsi 0:1:0:0: ABORT FAILED, lockup detected Direct-Access     HP       LOGICAL VOLUME   RAID-1(+0) SSDSmartPathCap+ En+ Exp=1
[31587155.972715] hpsa 0000:08:00.0: scsi 0:1:0:0: ABORT FAILED, lockup detected Direct-Access     HP       LOGICAL VOLUME   RAID-1(+0) SSDSmartPathCap+ En+ Exp=1
[31587155.972716] hpsa 0000:08:00.0: scsi 0:1:0:0: ABORT FAILED, lockup detected Direct-Access     HP       LOGICAL VOLUME   RAID-1(+0) SSDSmartPathCap+ En+ Exp=1
[31587155.972718] hpsa 0000:08:00.0: scsi 0:1:0:0: ABORT FAILED, lockup detected Direct-Access     HP       LOGICAL VOLUME   RAID-1(+0) SSDSmartPathCap+ En+ Exp=1
[31587155.972720] hpsa 0000:08:00.0: scsi 0:1:0:0: ABORT FAILED, lockup detected Direct-Access     HP       LOGICAL VOLUME   RAID-1(+0) SSDSmartPathCap+ En+ Exp=1
[31587155.972722] hpsa 0000:08:00.0: scsi 0:1:0:0: ABORT FAILED, lockup detected Direct-Access     HP       LOGICAL VOLUME   RAID-1(+0) SSDSmartPathCap+ En+ Exp=1
[31587155.972724] hpsa 0000:08:00.0: scsi 0:1:0:0: ABORT FAILED, lockup detected Direct-Access     HP       LOGICAL VOLUME   RAID-1(+0) SSDSmartPathCap+ En+ Exp=1
[31587155.972726] hpsa 0000:08:00.0: scsi 0:1:0:0: ABORT FAILED, lockup detected Direct-Access     HP       LOGICAL VOLUME   RAID-1(+0) SSDSmartPathCap+ En+ Exp=1
[31587155.972727] hpsa 0000:08:00.0: scsi 0:1:0:0: ABORT FAILED, lockup detected Direct-Access     HP       LOGICAL VOLUME   RAID-1(+0) SSDSmartPathCap+ En+ Exp=1
[31587155.972729] hpsa 0000:08:00.0: scsi 0:1:0:0: ABORT FAILED, lockup detected Direct-Access     HP       LOGICAL VOLUME   RAID-1(+0) SSDSmartPathCap+ En+ Exp=1
[31587155.972731] hpsa 0000:08:00.0: scsi 0:1:0:0: ABORT FAILED, lockup detected Direct-Access     HP       LOGICAL VOLUME   RAID-1(+0) SSDSmartPathCap+ En+ Exp=1
[31587155.972732] hpsa 0000:08:00.0: scsi 0:1:0:0: ABORT FAILED, lockup detected Direct-Access     HP       LOGICAL VOLUME   RAID-1(+0) SSDSmartPathCap+ En+ Exp=1
[31587155.972734] hpsa 0000:08:00.0: scsi 0:1:0:0: ABORT FAILED, lockup detected Direct-Access     HP       LOGICAL VOLUME   RAID-1(+0) SSDSmartPathCap+ En+ Exp=1
[31587155.972736] hpsa 0000:08:00.0: scsi 0:1:0:0: ABORT FAILED, lockup detected Direct-Access     HP       LOGICAL VOLUME   RAID-1(+0) SSDSmartPathCap+ En+ Exp=1
[31587155.972738] hpsa 0000:08:00.0: scsi 0:1:0:0: ABORT FAILED, lockup detected Direct-Access     HP       LOGICAL VOLUME   RAID-1(+0) SSDSmartPathCap+ En+ Exp=1
[31587155.972740] hpsa 0000:08:00.0: scsi 0:1:0:0: ABORT FAILED, lockup detected Direct-Access     HP       LOGICAL VOLUME   RAID-1(+0) SSDSmartPathCap+ En+ Exp=1
[31587155.972742] hpsa 0000:08:00.0: scsi 0:1:0:0: ABORT FAILED, lockup detected Direct-Access     HP       LOGICAL VOLUME   RAID-1(+0) SSDSmartPathCap+ En+ Exp=1
[31587155.972744] hpsa 0000:08:00.0: scsi 0:1:0:0: ABORT FAILED, lockup detected Direct-Access     HP       LOGICAL VOLUME   RAID-1(+0) SSDSmartPathCap+ En+ Exp=1
[31587155.972789] hpsa 0000:08:00.0: failed 101 commands in fail_all
[31587155.972799] sd 0:1:0:0: Device offlined - not ready after error recovery
[31587155.972802] sd 0:1:0:0: Device offlined - not ready after error recovery
[31587155.972803] sd 0:1:0:0: Device offlined - not ready after error recovery
[31587155.972804] sd 0:1:0:0: Device offlined - not ready after error recovery
[31587155.972805] sd 0:1:0:0: Device offlined - not ready after error recovery
[31587155.972806] sd 0:1:0:0: Device offlined - not ready after error recovery
[31587155.972807] sd 0:1:0:0: Device offlined - not ready after error recovery
[31587155.972808] sd 0:1:0:0: Device offlined - not ready after error recovery
[31587155.972809] sd 0:1:0:0: Device offlined - not ready after error recovery
[31587155.972810] sd 0:1:0:0: Device offlined - not ready after error recovery
[31587155.972811] sd 0:1:0:0: Device offlined - not ready after error recovery
[31587155.972811] sd 0:1:0:0: Device offlined - not ready after error recovery
[31587155.972812] sd 0:1:0:0: Device offlined - not ready after error recovery
[31587155.972813] sd 0:1:0:0: Device offlined - not ready after error recovery
[31587155.972814] sd 0:1:0:0: Device offlined - not ready after error recovery
[31587155.972815] sd 0:1:0:0: Device offlined - not ready after error recovery
[31587155.972815] sd 0:1:0:0: Device offlined - not ready after error recovery
[31587155.972816] sd 0:1:0:0: Device offlined - not ready after error recovery
[31587155.972817] sd 0:1:0:0: Device offlined - not ready after error recovery
[31587155.972818] sd 0:1:0:0: Device offlined - not ready after error recovery
[31587155.972819] sd 0:1:0:0: Device offlined - not ready after error recovery
[31587155.972819] sd 0:1:0:0: Device offlined - not ready after error recovery
[31587155.972820] sd 0:1:0:0: Device offlined - not ready after error recovery
[31587155.972821] sd 0:1:0:0: Device offlined - not ready after error recovery
[31587155.972822] sd 0:1:0:0: Device offlined - not ready after error recovery
[31587155.972823] sd 0:1:0:0: Device offlined - not ready after error recovery
[31587155.972823] sd 0:1:0:0: Device offlined - not ready after error recovery
[31587155.972824] sd 0:1:0:0: Device offlined - not ready after error recovery
[31587155.972825] sd 0:1:0:0: Device offlined - not ready after error recovery
[31587155.972826] sd 0:1:0:0: Device offlined - not ready after error recovery
[31587155.972827] sd 0:1:0:0: Device offlined - not ready after error recovery
[31587155.972828] sd 0:1:0:0: Device offlined - not ready after error recovery
[31587155.972829] sd 0:1:0:0: Device offlined - not ready after error recovery
[31587155.972830] sd 0:1:0:0: Device offlined - not ready after error recovery
[31587155.972831] sd 0:1:0:0: Device offlined - not ready after error recovery
[31587155.972832] sd 0:1:0:0: Device offlined - not ready after error recovery
[31587155.972833] sd 0:1:0:0: Device offlined - not ready after error recovery
[31587155.972834] sd 0:1:0:0: Device offlined - not ready after error recovery
[31587155.972835] sd 0:1:0:0: Device offlined - not ready after error recovery
[31587155.972836] sd 0:1:0:0: Device offlined - not ready after error recovery
[31587155.972836] sd 0:1:0:0: Device offlined - not ready after error recovery
[31587155.972837] sd 0:1:0:0: Device offlined - not ready after error recovery
[31587155.972838] sd 0:1:0:0: Device offlined - not ready after error recovery
[31587155.972839] sd 0:1:0:0: Device offlined - not ready after error recovery
[31587155.972840] sd 0:1:0:0: Device offlined - not ready after error recovery
[31587155.972840] sd 0:1:0:0: Device offlined - not ready after error recovery
[31587155.972841] sd 0:1:0:0: Device offlined - not ready after error recovery
[31587155.972842] sd 0:1:0:0: Device offlined - not ready after error recovery
[31587155.972843] sd 0:1:0:0: Device offlined - not ready after error recovery
[31587155.972844] sd 0:1:0:0: Device offlined - not ready after error recovery
[31587155.972844] sd 0:1:0:0: Device offlined - not ready after error recovery
[31587155.972845] sd 0:1:0:0: Device offlined - not ready after error recovery
[31587155.972846] sd 0:1:0:0: Device offlined - not ready after error recovery
[31587155.972847] sd 0:1:0:0: Device offlined - not ready after error recovery
[31587155.972848] sd 0:1:0:0: Device offlined - not ready after error recovery
[31587155.972848] sd 0:1:0:0: Device offlined - not ready after error recovery
[31587155.972849] sd 0:1:0:0: Device offlined - not ready after error recovery
[31587155.972850] sd 0:1:0:0: Device offlined - not ready after error recovery
[31587155.972851] sd 0:1:0:0: Device offlined - not ready after error recovery
[31587155.972852] sd 0:1:0:0: Device offlined - not ready after error recovery
[31587155.972852] sd 0:1:0:0: Device offlined - not ready after error recovery
[31587155.972853] sd 0:1:0:0: Device offlined - not ready after error recovery
[31587155.972854] sd 0:1:0:0: Device offlined - not ready after error recovery
[31587155.972855] sd 0:1:0:0: Device offlined - not ready after error recovery
[31587155.972856] sd 0:1:0:0: Device offlined - not ready after error recovery
[31587155.972856] sd 0:1:0:0: Device offlined - not ready after error recovery
[31587155.972857] sd 0:1:0:0: Device offlined - not ready after error recovery
[31587155.972858] sd 0:1:0:0: Device offlined - not ready after error recovery
[31587155.972859] sd 0:1:0:0: Device offlined - not ready after error recovery
[31587155.972860] sd 0:1:0:0: Device offlined - not ready after error recovery
[31587155.972861] sd 0:1:0:0: Device offlined - not ready after error recovery
[31587155.972862] sd 0:1:0:0: Device offlined - not ready after error recovery
[31587155.972863] sd 0:1:0:0: Device offlined - not ready after error recovery
[31587155.972864] sd 0:1:0:0: Device offlined - not ready after error recovery
[31587155.972865] sd 0:1:0:0: Device offlined - not ready after error recovery
[31587155.972866] sd 0:1:0:0: Device offlined - not ready after error recovery
[31587155.972867] sd 0:1:0:0: Device offlined - not ready after error recovery
[31587155.972868] sd 0:1:0:0: Device offlined - not ready after error recovery
[31587155.972869] sd 0:1:0:0: Device offlined - not ready after error recovery
[31587155.972869] sd 0:1:0:0: Device offlined - not ready after error recovery
[31587155.972870] sd 0:1:0:0: Device offlined - not ready after error recovery
[31587155.972871] sd 0:1:0:0: Device offlined - not ready after error recovery
[31587155.972872] sd 0:1:0:0: Device offlined - not ready after error recovery
[31587155.972873] sd 0:1:0:0: Device offlined - not ready after error recovery
[31587155.972873] sd 0:1:0:0: Device offlined - not ready after error recovery
[31587155.972874] sd 0:1:0:0: Device offlined - not ready after error recovery
[31587155.972875] sd 0:1:0:0: Device offlined - not ready after error recovery
[31587155.972876] sd 0:1:0:0: Device offlined - not ready after error recovery
[31587155.972877] sd 0:1:0:0: Device offlined - not ready after error recovery
[31587155.972877] sd 0:1:0:0: Device offlined - not ready after error recovery
[31587155.972878] sd 0:1:0:0: Device offlined - not ready after error recovery
[31587155.972879] sd 0:1:0:0: Device offlined - not ready after error recovery
[31587155.972880] sd 0:1:0:0: Device offlined - not ready after error recovery
[31587155.972881] sd 0:1:0:0: Device offlined - not ready after error recovery
[31587155.972881] sd 0:1:0:0: Device offlined - not ready after error recovery
[31587155.972882] sd 0:1:0:0: Device offlined - not ready after error recovery
[31587155.972883] sd 0:1:0:0: Device offlined - not ready after error recovery
[31587155.972884] sd 0:1:0:0: Device offlined - not ready after error recovery
[31587155.972885] sd 0:1:0:0: Device offlined - not ready after error recovery
[31587155.972885] sd 0:1:0:0: Device offlined - not ready after error recovery
[31587155.972894] sd 0:1:0:0: [sda] tag#99 FAILED Result: hostbyte=DID_NO_CONNECT driverbyte=DRIVER_OK
[31587155.972896] sd 0:1:0:0: [sda] tag#99 CDB: Write(16) 8a 00 00 00 00 00 0c b1 a4 c0 00 00 00 c0 00 00
[31587155.972898] blk_update_request: I/O error, dev sda, sector 212968640
[31587156.002428] sd 0:1:0:0: rejecting I/O to offline device
[31587156.027350] sd 0:1:0:0: [sda] killing request
[31587156.027355] sd 0:1:0:0: rejecting I/O to offline device
[31587156.052189] sd 0:1:0:0: rejecting I/O to offline device
[31587156.076904] sd 0:1:0:0: rejecting I/O to offline device
[31587156.101702] sd 0:1:0:0: [sda] FAILED Result: hostbyte=DID_NO_CONNECT driverbyte=DRIVER_OK
[31587156.101703] sd 0:1:0:0: [sda] CDB: Write(16) 8a 00 00 00 00 00 0c b1 ae 00 00 00 01 f0 00 00
[31587156.101704] blk_update_request: I/O error, dev sda, sector 212971008
[31587156.131612] sd 0:1:0:0: [sda] tag#98 FAILED Result: hostbyte=DID_NO_CONNECT driverbyte=DRIVER_OK
[31587156.131614] sd 0:1:0:0: [sda] tag#98 CDB: Write(16) 8a 00 00 00 00 00 0d 5e 0e 50 00 00 00 48 00 00
[31587156.131615] blk_update_request: I/O error, dev sda, sector 224267856
[31587156.161449] sd 0:1:0:0: [sda] tag#97 FAILED Result: hostbyte=DID_NO_CONNECT driverbyte=DRIVER_OK
[31587156.161451] sd 0:1:0:0: [sda] tag#97 CDB: Write(16) 8a 00 00 00 00 00 0d 5e 0e 28 00 00 00 28 00 00
[31587156.161451] blk_update_request: I/O error, dev sda, sector 224267816
[31587156.190988] sd 0:1:0:0: [sda] tag#95 FAILED Result: hostbyte=DID_NO_CONNECT driverbyte=DRIVER_OK
[31587156.190989] sd 0:1:0:0: [sda] tag#95 CDB: Write(16) 8a 00 00 00 00 00 0c b1 a2 f0 00 00 01 d0 00 00
[31587156.190990] blk_update_request: I/O error, dev sda, sector 212968176
[31587156.220436] sd 0:1:0:0: [sda] tag#96 FAILED Result: hostbyte=DID_NO_CONNECT driverbyte=DRIVER_OK
[31587156.220437] sd 0:1:0:0: [sda] tag#96 CDB: Write(16) 8a 00 00 00 00 00 0d 5e 0e 08 00 00 00 20 00 00
[31587156.220438] blk_update_request: I/O error, dev sda, sector 224267784
[31587156.250233] sd 0:1:0:0: [sda] tag#94 FAILED Result: hostbyte=DID_NO_CONNECT driverbyte=DRIVER_OK
[31587156.250234] sd 0:1:0:0: [sda] tag#94 CDB: Write(16) 8a 00 00 00 00 00 0d 5e 0d c8 00 00 00 40 00 00
[31587156.250253] blk_update_request: I/O error, dev sda, sector 224267720
[31587156.280300] sd 0:1:0:0: [sda] tag#93 FAILED Result: hostbyte=DID_NO_CONNECT driverbyte=DRIVER_OK
[31587156.280301] sd 0:1:0:0: [sda] tag#93 CDB: Write(16) 8a 00 00 00 00 00 0d 5e 0c c8 00 00 01 00 00 00
[31587156.280302] blk_update_request: I/O error, dev sda, sector 224267464
[31587156.310191] sd 0:1:0:0: [sda] tag#91 FAILED Result: hostbyte=DID_NO_CONNECT driverbyte=DRIVER_OK
[31587156.310193] sd 0:1:0:0: [sda] tag#91 CDB: Write(16) 8a 00 00 00 00 00 0c b1 a2 50 00 00 00 a0 00 00
[31587156.310210] blk_update_request: I/O error, dev sda, sector 212968016
[31587156.340117] sd 0:1:0:0: [sda] tag#92 FAILED Result: hostbyte=DID_NO_CONNECT driverbyte=DRIVER_OK
[31587156.340119] sd 0:1:0:0: [sda] tag#92 CDB: Write(16) 8a 00 00 00 00 00 0d 5e 0c 48 00 00 00 80 00 00
[31587156.340120] blk_update_request: I/O error, dev sda, sector 224267336
[31587156.370213] Buffer I/O error on dev dm-0, logical block 180519513, lost async page write
[31587156.408039] EXT4-fs warning (device sda1): ext4_end_bio:329: I/O error -5 writing to inode 1782594 (offset 0 size 0 starting block 4483536)
[31587156.408042] Buffer I/O error on device sda1, logical block 4483214
[31587156.437639] Buffer I/O error on device sda1, logical block 4483215
[31587156.467747] EXT4-fs warning (device sda1): ext4_end_bio:329: I/O error -5 writing to inode 1784220 (offset 0 size 0 starting block 9605046)
[31587156.467748] Buffer I/O error on device sda1, logical block 9604725
[31587156.496944] JBD2: Detected IO errors while flushing file data on sda1-8
[31587156.496953] Aborting journal on device sda1-8.
[31587156.497017] Buffer I/O error on dev dm-0, logical block 3443576, lost async page write
[31587156.497022] Buffer I/O error on dev dm-0, logical block 3443577, lost async page write
[31587156.497068] Buffer I/O error on dev dm-0, logical block 14901720, lost async page write
[31587156.497071] Buffer I/O error on dev dm-0, logical block 14901721, lost async page write
[31587156.497072] Buffer I/O error on dev dm-0, logical block 14901722, lost async page write
[31587156.497073] Buffer I/O error on dev dm-0, logical block 14901723, lost async page write
[31587156.497074] Buffer I/O error on dev dm-0, logical block 14901724, lost async page write
[31587156.497075] Buffer I/O error on dev dm-0, logical block 14901725, lost async page write
[31587156.497076] Buffer I/O error on dev dm-0, logical block 14901726, lost async page write
[31587156.497839] EXT4-fs error (device sda1) in ext4_evict_inode:241: Readonly filesystem
[31587156.497857] XFS (dm-0): metadata I/O error: block 0x7191ce0 ("xfs_buf_iodone_callbacks") error 5 numblks 16
[31587156.497869] sd 0:1:0:0: rejecting I/O to offline device
[31587156.497876] Aborting journal on device sda1-8.
[31587156.497881] sd 0:1:0:0: rejecting I/O to offline device
[31587156.497886] sd 0:1:0:0: rejecting I/O to offline device
[31587156.497887] JBD2: Error -5 detected when updating journal superblock for sda1-8.
[31587156.497888] EXT4-fs (sda1): Remounting filesystem read-only
[31587156.497915] sd 0:1:0:0: rejecting I/O to offline device
[31587156.497919] sd 0:1:0:0: rejecting I/O to offline device
[31587156.497922] sd 0:1:0:0: rejecting I/O to offline device
[31587156.497925] sd 0:1:0:0: rejecting I/O to offline device
[31587156.497932] XFS (dm-0): metadata I/O error: block 0xe624c3b0 ("xlog_iodone") error 5 numblks 64
[31587156.497934] XFS (dm-0): xfs_do_force_shutdown(0x2) called from line 1197 of file /tmp/buildd/linux-4.4.2/fs/xfs/xfs_log.c.  Return address = 0xffffffffa070914d
[31587156.497961] XFS (dm-0): xfs_log_force: error -5 returned.
[31587156.497987] XFS (dm-0): Log I/O Error Detected.  Shutting down filesystem
[31587156.497988] XFS (dm-0): Please umount the filesystem and rectify the problem(s)
[31587156.497989] XFS (dm-0): metadata I/O error: block 0xe624c3a8 ("xlog_iodone") error 5 numblks 64
[31587156.497990] XFS (dm-0): xfs_do_force_shutdown(0x2) called from line 1197 of file /tmp/buildd/linux-4.4.2/fs/xfs/xfs_log.c.  Return address = 0xffffffffa070914d
[31587156.497991] XFS (dm-0): metadata I/O error: block 0xe624c3a0 ("xlog_iodone") error 5 numblks 64
[31587156.497992] XFS (dm-0): xfs_do_force_shutdown(0x2) called from line 1197 of file /tmp/buildd/linux-4.4.2/fs/xfs/xfs_log.c.  Return address = 0xffffffffa070914d
[31587156.497994] XFS (dm-0): metadata I/O error: block 0xe624c398 ("xlog_iodone") error 5 numblks 64
[31587156.497995] XFS (dm-0): xfs_do_force_shutdown(0x2) called from line 1197 of file /tmp/buildd/linux-4.4.2/fs/xfs/xfs_log.c.  Return address = 0xffffffffa070914d
[31587156.497996] XFS (dm-0): metadata I/O error: block 0xe624c390 ("xlog_iodone") error 5 numblks 64
[31587156.497996] XFS (dm-0): xfs_do_force_shutdown(0x2) called from line 1197 of file /tmp/buildd/linux-4.4.2/fs/xfs/xfs_log.c.  Return address = 0xffffffffa070914d
[31587156.497997] XFS (dm-0): metadata I/O error: block 0xe624c388 ("xlog_iodone") error 5 numblks 64
[31587156.497998] XFS (dm-0): xfs_do_force_shutdown(0x2) called from line 1197 of file /tmp/buildd/linux-4.4.2/fs/xfs/xfs_log.c.  Return address = 0xffffffffa070914d
[31587156.497999] XFS (dm-0): metadata I/O error: block 0xe624c378 ("xlog_iodone") error 5 numblks 64
[31587156.498000] XFS (dm-0): xfs_do_force_shutdown(0x2) called from line 1197 of file /tmp/buildd/linux-4.4.2/fs/xfs/xfs_log.c.  Return address = 0xffffffffa070914d
[31587156.498001] XFS (dm-0): metadata I/O error: block 0xe624c380 ("xlog_iodone") error 5 numblks 64
[31587156.498001] XFS (dm-0): xfs_do_force_shutdown(0x2) called from line 1197 of file /tmp/buildd/linux-4.4.2/fs/xfs/xfs_log.c.  Return address = 0xffffffffa070914d
[31587156.512075] XFS (dm-0): xfs_log_force: error -5 returned.
[31587156.550816] XFS (dm-0): xfs_log_force: error -5 returned.
[31587157.626167] sd 0:1:0:0: rejecting I/O to offline device
[31587157.651939] JBD2: Error -5 detected when updating journal superblock for sda1-8.
[31587157.687697] sd 0:1:0:0: rejecting I/O to offline device
[31587157.713269] EXT4-fs warning (device sda1): ext4_end_bio:329: I/O error -5 writing to inode 1782594 (offset 0 size 0 starting block 4483536)
[31587157.713272] Buffer I/O error on device sda1, logical block 4483215
[31587157.743552] sd 0:1:0:0: rejecting I/O to offline device
[31587157.768930] EXT4-fs warning (device sda1): ext4_end_bio:329: I/O error -5 writing to inode 1784220 (offset 0 size 0 starting block 9605046)
[31587157.768931] Buffer I/O error on device sda1, logical block 9604725
[31587157.798646] JBD2: Detected IO errors while flushing file data on sda1-8
[31587186.565748] XFS (dm-0): xfs_log_force: error -5 returned.
[31587216.647032] XFS (dm-0): xfs_log_force: error -5 returned.
[31587246.728308] XFS (dm-0): xfs_log_force: error -5 returned.
[31587276.809588] XFS (dm-0): xfs_log_force: error -5 returned.
[31587280.082558] sd 0:1:0:0: rejecting I/O to offline device
[31587280.107411] sd 0:1:0:0: rejecting I/O to offline device
[31587282.903387] sd 0:1:0:0: rejecting I/O to offline device
[31587282.929530] sd 0:1:0:0: rejecting I/O to offline device
[31587282.955903] sd 0:1:0:0: rejecting I/O to offline device
[31587300.030634] sd 0:1:0:0: rejecting I/O to offline device
[31587300.055324] sd 0:1:0:0: rejecting I/O to offline device
[31587300.080134] sd 0:1:0:0: rejecting I/O to offline device
[31587306.890869] XFS (dm-0): xfs_log_force: error -5 returned.
[31587330.162877] sd 0:1:0:0: rejecting I/O to offline device
[31587330.188030] sd 0:1:0:0: rejecting I/O to offline device
[31587330.212995] sd 0:1:0:0: rejecting I/O to offline device

Event Timeline

Restricted Application added a subscriber: Aklapper. · View Herald TranscriptJun 3 2017, 5:11 AM

Checking at the ILO logs, the only ones without a date (that might be related to this) are:

</system1/log1>hpiLO-> show record6

status=0
status_tag=COMMAND COMPLETED
Sat Jun  3 05:01:09 2017



/system1/log1/record6
  Targets
  Properties
    number=6
    severity=Caution
    date=[NOT SET]
    time=
    description=POST Error: 289-IMPORTANT: A new network or storage device has been detected. This device will not be shown in the Legacy BIOS Boot Order options in RBSU until the system has booted once. Action: No action required.
  Verbs
    cd version exit show

</system1/log1>hpiLO-> show record2

status=0
status_tag=COMMAND COMPLETED
Sat Jun  3 05:00:45 2017



/system1/log1/record2
  Targets
  Properties
    number=2
    severity=Informational
    date=[NOT SET]
    time=
    description=Option ROM POST Information: Action: Use the HP SSA to configure the attached drives.
  Verbs
    cd version exit show

Mentioned in SAL (#wikimedia-operations) [2017-06-03T05:20:35Z] <marostegui> Reboot db1089 - T166933

This happens during startup:

Slot 1 Port 1 : Smart Array P840 Controller - (4096 MB, V3.56) 1 Logical
Drive(s) - Operation Failed
 - 1719-Slot 1 Drive Array - A controller failure event occurred prior
   to this power-up.  (Previous lock up code = 0x13) Action: Install the
   latest controller firmware. If the problem persists, replace the
   controller.


Important information available or errors detected
 Press 'ESC+1' to continue, or 'ESC+2' for more information
Marostegui renamed this task from db1089 possibly HW issues to db1089 - RAID controller broken.Jun 3 2017, 5:23 AM
Marostegui renamed this task from db1089 - RAID controller broken to db1089 - possibly RAID controller broken.
Marostegui added a project: ops-eqiad.

After the reboot the host looks good:

[   32.929570] hpsa 0000:08:00.0: Acknowledging event: 0xc0000000 (HP SSD Smart Path configuration change)
[   32.969457] hpsa 0000:08:00.0: scsi 0:1:0:0: updated Direct-Access     HP       LOGICAL VOLUME   RAID-1(+0) SSDSmartPathCap+ En+ Exp=1

Going to reboot it again to see what we get during the startup

A second reboot doesn't show anything about the RAID controller, so this might have been a punctual thing.
I will close this ticket now and at least it is recorded that this host that had issue.

Marostegui closed this task as Resolved.Jun 3 2017, 5:33 AM
Marostegui claimed this task.